Failure during the make of compiz-9999:arcon

Compiz, KDE, Gnome, Fluxbox, etc...

Moderator: Moderators

Failure during the make of compiz-9999:arcon

Postby FuzZy2006 » Thu Jan 31, 2008 14:35

I'm trying to install compiz-9999 on sabayon-3.5 loop1 (git-version from the arcon overlay) and i get this error during the make:
These packages will be installed:

* x11-wm/compiz::x-arcon-overlay [U 0.6.2-r1 -> 9999] <target>
dbus -fuse+ -gnome* gtk+ kde kde4+ svg xcb+

Total: 1 package (1 upgrade)

Use flags:

* fuse:
* gnome: Adds GNOME support
* gtk: Adds support for x11-libs/gtk+ (The GIMP Toolkit)
* kde4:
* xcb: Support the X C-language Binding, a replacement for Xlib

(1 of 1) Installing x11-wm/compiz-9999:0::x-arcon-overlay

[email protected]: [WARNING] In program paludis -Ui compiz:
... When performing install action from command line:
... When executing install task:
... When fetching 'x11-wm/compiz-9999:0::x-arcon-overlay':
... When checking permissions on '/usr/portage/distfiles' for userpriv:
... Directory '/usr/portage/distfiles' owned by group 'portage', not 'paludisbuild', so cannot enable userpriv
[email protected]: [WARNING] In program paludis -Ui compiz:
... When performing install action from command line:
... When executing install task:
... When installing 'x11-wm/compiz-9999:0::x-arcon-overlay':
... When checking permissions on '/var/tmp/paludis' for userpriv:
... Directory '/var/tmp/paludis' owned by group 'root', not 'paludisbuild', cannot enable userpriv
>>> Running ebuild phase prepare as root:root...
>>> Starting builtin_prepare
>>> Done builtin_prepare
>>> Completed ebuild phase prepare
>>> Running ebuild phases init saveenv as root:root...
>>> Starting builtin_init
>>> Done builtin_init
>>> Starting builtin_saveenv
>>> Done builtin_saveenv
>>> Completed ebuild phases init saveenv
>>> Running ebuild phases loadenv setup saveenv as root:root...
>>> Starting builtin_loadenv
>>> Done builtin_loadenv
>>> Starting pkg_setup
>>> Done pkg_setup
>>> Starting builtin_saveenv
>>> Done builtin_saveenv
>>> Completed ebuild phases loadenv setup saveenv
>>> Running ebuild phases loadenv unpack compile saveenv as root:root...
>>> Starting builtin_loadenv
>>> Done builtin_loadenv
>>> Starting src_unpack
* git update start -->
* repository: git://anongit.freedesktop.org/git/xorg/app/compiz
* local clone: /usr/portage/distfiles/git-src/compiz
* committish: master
>>> Unpacked to /var/tmp/paludis/x11-wm/compiz-9999/work/compiz-9999
* Applying compiz-no-gconf.patch ... [ ok ]
>>> Done src_unpack
>>> Starting src_compile
* Running eautoreconf in '/var/tmp/paludis/x11-wm/compiz-9999/work/compiz-9999' ...
* QA Warning: running aclocal in compile phase
* Running aclocal ... [ ok ]
* QA Warning: running libtoolize in compile phase
* Running libtoolize --copy --force --automake ... [ ok ]
* QA Warning: running aclocal in compile phase
* Running aclocal ... [ ok ]
* QA Warning: running autoconf in compile phase
* Running autoconf ... [ ok ]
* QA Warning: running autoheader in compile phase
* Running autoheader ... [ ok ]
* QA Warning: running automake in compile phase
* Running automake --add-missing --copy ... [ ok ]
* Running elibtoolize in: compiz-9999
* Applying sed-1.5.6.patch ...
You should update your 'aclocal.m4' by running aclocal.
Copying file mkinstalldirs
Copying file po/Makefile.in.in

Please add the files
codeset.m4 gettext.m4 glibc21.m4 iconv.m4 isc-posix.m4 lcmessage.m4
progtest.m4
from the /usr/share/aclocal directory to your autoconf macro directory
or directly to your aclocal.m4 file.
You will also need config.guess and config.sub, which you can get from
ftp://ftp.gnu.org/pub/gnu/config/.

econf: updating /var/tmp/paludis/x11-wm/compiz-9999/work/compiz-9999/config.sub with /usr/share/gnuconfig/config.sub
econf: updating /var/tmp/paludis/x11-wm/compiz-9999/work/compiz-9999/config.guess with /usr/share/gnuconfig/config.guess
./configure --prefix=/usr --host=i586-pc-linux-gnu --mandir=/usr/share/man --infodir=/usr/share/info --datadir=/usr/share --sysconfdir=/etc --localstatedir=/var/lib --with-default-plugins --enable-gtk --disable-gconf --disable-gnome --disable-metacity --enable-kde --enable-kde4 --enable-librsvg --enable-dbus --enable-dbus-glib --disable-fuse --build=i586-pc-linux-gnu
checking for a BSD-compatible install... /usr/bin/install -c
checking whether build environment is sane... yes
checking for a thread-safe mkdir -p... /bin/mkdir -p
checking for gawk... gawk
checking whether make sets $(MAKE)... yes
checking for style of include used by make... GNU
checking for i586-pc-linux-gnu-gcc... i586-pc-linux-gnu-gcc
checking for C compiler default output file name... a.out
checking whether the C compiler works... yes
checking whether we are cross compiling... no
checking for suffix of executables...
checking for suffix of object files... o
checking whether we are using the GNU C compiler... yes
checking whether i586-pc-linux-gnu-gcc accepts -g... yes
checking for i586-pc-linux-gnu-gcc option to accept ISO C89... none needed
checking dependency style of i586-pc-linux-gnu-gcc... gcc3
checking for intltool >= 0.23... 0.35.5 found
checking for perl... /usr/bin/perl
checking for XML::Parser... ok
checking for iconv... /usr/bin/iconv
checking for msgfmt... /usr/bin/msgfmt
checking for msgmerge... /usr/bin/msgmerge
checking for xgettext... /usr/bin/xgettext
checking whether to enable maintainer-specific portions of Makefiles... no
checking for library containing strerror... none required
checking for i586-pc-linux-gnu-gcc... (cached) i586-pc-linux-gnu-gcc
checking whether we are using the GNU C compiler... (cached) yes
checking whether i586-pc-linux-gnu-gcc accepts -g... (cached) yes
checking for i586-pc-linux-gnu-gcc option to accept ISO C89... (cached) none needed
checking dependency style of i586-pc-linux-gnu-gcc... (cached) gcc3
checking how to run the C preprocessor... i586-pc-linux-gnu-gcc -E
checking for i586-pc-linux-gnu-g++... i586-pc-linux-gnu-g++
checking whether we are using the GNU C++ compiler... yes
checking whether i586-pc-linux-gnu-g++ accepts -g... yes
checking dependency style of i586-pc-linux-gnu-g++... gcc3
checking build system type... i586-pc-linux-gnu
checking host system type... i586-pc-linux-gnu
checking for a sed that does not truncate output... /usr/libexec/paludis/utils/sed
checking for grep that handles long lines and -e... /bin/grep
checking for egrep... /bin/grep -E
checking for ld used by i586-pc-linux-gnu-gcc... /usr/i586-pc-linux-gnu/bin/ld
checking if the linker (/usr/i586-pc-linux-gnu/bin/ld) is GNU ld... yes
checking for /usr/i586-pc-linux-gnu/bin/ld option to reload object files... -r
checking for BSD-compatible nm... /usr/bin/nm -B
checking whether ln -s works... yes
checking how to recognize dependent libraries... pass_all
checking for ANSI C header files... yes
checking for sys/types.h... yes
checking for sys/stat.h... yes
checking for stdlib.h... yes
checking for string.h... yes
checking for memory.h... yes
checking for strings.h... yes
checking for inttypes.h... yes
checking for stdint.h... yes
checking for unistd.h... yes
checking dlfcn.h usability... yes
checking dlfcn.h presence... yes
checking for dlfcn.h... yes
checking how to run the C++ preprocessor... i586-pc-linux-gnu-g++ -E
checking for i586-pc-linux-gnu-g77... no
checking for i586-pc-linux-gnu-xlf... no
checking for i586-pc-linux-gnu-f77... no
checking for i586-pc-linux-gnu-frt... no
checking for i586-pc-linux-gnu-pgf77... no
checking for i586-pc-linux-gnu-cf77... no
checking for i586-pc-linux-gnu-fort77... no
checking for i586-pc-linux-gnu-fl32... no
checking for i586-pc-linux-gnu-af77... no
checking for i586-pc-linux-gnu-xlf90... no
checking for i586-pc-linux-gnu-f90... no
checking for i586-pc-linux-gnu-pgf90... no
checking for i586-pc-linux-gnu-pghpf... no
checking for i586-pc-linux-gnu-epcf90... no
checking for i586-pc-linux-gnu-gfortran... i586-pc-linux-gnu-gfortran
checking whether we are using the GNU Fortran 77 compiler... yes
checking whether i586-pc-linux-gnu-gfortran accepts -g... yes
checking the maximum length of command line arguments... 98304
checking command to parse /usr/bin/nm -B output from i586-pc-linux-gnu-gcc object... ok
checking for objdir... .libs
checking for i586-pc-linux-gnu-ar... i586-pc-linux-gnu-ar
checking for i586-pc-linux-gnu-ranlib... i586-pc-linux-gnu-ranlib
checking for i586-pc-linux-gnu-strip... i586-pc-linux-gnu-strip
checking for correct ltmain.sh version... yes
checking if i586-pc-linux-gnu-gcc supports -fno-rtti -fno-exceptions... no
checking for i586-pc-linux-gnu-gcc option to produce PIC... -fPIC
checking if i586-pc-linux-gnu-gcc PIC flag -fPIC works... yes
checking if i586-pc-linux-gnu-gcc static flag -static works... yes
checking if i586-pc-linux-gnu-gcc supports -c -o file.o... yes
checking whether the i586-pc-linux-gnu-gcc linker (/usr/i586-pc-linux-gnu/bin/ld) supports shared libraries... yes
checking whether -lc should be explicitly linked in... no
checking dynamic linker characteristics... GNU/Linux ld.so
checking how to hardcode library paths into programs... immediate
checking whether stripping libraries is possible... yes
checking if libtool supports shared libraries... yes
checking whether to build shared libraries... yes
checking whether to build static libraries... yes
configure: creating libtool
appending configuration tag "CXX" to libtool
checking for ld used by i586-pc-linux-gnu-g++... /usr/i586-pc-linux-gnu/bin/ld
checking if the linker (/usr/i586-pc-linux-gnu/bin/ld) is GNU ld... yes
checking whether the i586-pc-linux-gnu-g++ linker (/usr/i586-pc-linux-gnu/bin/ld) supports shared libraries... yes
checking for i586-pc-linux-gnu-g++ option to produce PIC... -fPIC
checking if i586-pc-linux-gnu-g++ PIC flag -fPIC works... yes
checking if i586-pc-linux-gnu-g++ static flag -static works... yes
checking if i586-pc-linux-gnu-g++ supports -c -o file.o... yes
checking whether the i586-pc-linux-gnu-g++ linker (/usr/i586-pc-linux-gnu/bin/ld) supports shared libraries... yes
checking dynamic linker characteristics... GNU/Linux ld.so
checking how to hardcode library paths into programs... immediate
appending configuration tag "F77" to libtool
checking if libtool supports shared libraries... yes
checking whether to build shared libraries... yes
checking whether to build static libraries... yes
checking for i586-pc-linux-gnu-gfortran option to produce PIC... -fPIC
checking if i586-pc-linux-gnu-gfortran PIC flag -fPIC works... yes
checking if i586-pc-linux-gnu-gfortran static flag -static works... yes
checking if i586-pc-linux-gnu-gfortran supports -c -o file.o... yes
checking whether the i586-pc-linux-gnu-gfortran linker (/usr/i586-pc-linux-gnu/bin/ld) supports shared libraries... yes
checking dynamic linker characteristics... GNU/Linux ld.so
checking how to hardcode library paths into programs... immediate
checking for ANSI C header files... (cached) yes
checking for stdlib.h... (cached) yes
checking sys/time.h usability... yes
checking sys/time.h presence... yes
checking for sys/time.h... yes
checking for unistd.h... (cached) yes
checking locale.h usability... yes
checking locale.h presence... yes
checking for locale.h... yes
checking for LC_MESSAGES... yes
checking libintl.h usability... yes
checking libintl.h presence... yes
checking for libintl.h... yes
checking for ngettext in libc... yes
checking for dgettext in libc... yes
checking for bind_textdomain_codeset... yes
checking for msgfmt... /usr/bin/msgfmt
checking for dcgettext... yes
checking if msgfmt accepts -c... yes
checking for gmsgfmt... /usr/bin/gmsgfmt
checking for xgettext... /usr/bin/xgettext
checking for catalogs to be installed...
checking whether byte ordering is bigendian... no
checking for i586-pc-linux-gnu-pkg-config... no
checking for pkg-config... /usr/bin/pkg-config
checking pkg-config is at least version 0.9.0... yes
checking for COMPIZ... yes
checking for DECORATION... yes
checking for GL_CFLAGS...
checking for GL_LIBS... -lGL
checking for xsltproc... xsltproc
checking for LIBPNG... yes
checking for GLIB... yes
Using config source xml:merged:/etc/gconf/gconf.xml.defaults for schema installation
Using $(sysconfdir)/gconf/schemas as install directory for schema files
checking for PLACE... yes
checking for DBUS... yes
checking for DBUS_GLIB... yes
checking sys/inotify.h usability... yes
checking sys/inotify.h presence... yes
checking for sys/inotify.h... yes
checking for ANNOTATE... yes
checking for LIBRSVG... yes
checking for GTK_WINDOW_DECORATOR... yes
checking for wnck_window_has_name... yes
checking for GNOME_KEY_BINDINGS... yes
checking for Qt headers... /usr/qt/3/include
checking for Qt libraries... /usr/qt/3/lib
checking for KDE_WINDOW_DECORATOR... yes
checking for KWin headers... kdecoration.h kcommondecoration.h kdecorationbridge.h not found
checking for KDE4_WINDOW_DECORATOR... yes
configure: creating ./config.status
config.status: creating compiz.pc
config.status: creating compiz-cube.pc
config.status: creating compiz-scale.pc
config.status: creating compiz-gconf.pc
config.status: creating compiz-kconfig.pc
config.status: creating Makefile
config.status: creating src/Makefile
config.status: creating libdecoration/Makefile
config.status: creating libdecoration/libdecoration.pc
config.status: creating include/Makefile
config.status: creating plugins/Makefile
config.status: creating images/Makefile
config.status: creating gtk/Makefile
config.status: creating gtk/window-decorator/Makefile
config.status: creating gtk/gnome/Makefile
config.status: creating kde/Makefile
config.status: creating kde/window-decorator/Makefile
config.status: creating kde/window-decorator-kde4/Makefile
config.status: creating po/Makefile.in
config.status: creating metadata/Makefile
config.status: creating config.h
config.status: executing depfiles commands
config.status: executing intltool commands
config.status: executing default-1 commands
config.status: executing include/compiz-common.h commands
config.status: creating include/compiz-common.h
config.status: executing po/stamp-it commands

the following optional plugins will be compiled:
glib: yes
gconf: no
kconfig: yes
place: yes
dbus: yes
annotate: yes
svg: yes
inotify: yes
fuse: no

and the following optional features will be compiled:
gtk: yes
metacity: no
gnome: no
kde: yes
kde4: yes

make -j2 -s
Making all in include
Making all in src
mkdir .libs
i586-pc-linux-gnu-gcc -Os -march=i686 -Wall -Wpointer-arith -Wstrict-prototypes -Wmissing-prototypes -Wmissing-declarations -Wnested-externs -D_FORTIFY_SOURCE=2 -o compiz main.o privates.o object.o core.o texture.o display.o screen.o window.o event.o paint.o option.o plugin.o session.o fragment.o matrix.o cursor.o match.o metadata.o -Wl,--export-dynamic /usr/lib/libX11-xcb.so /usr/lib/libXcomposite.so /usr/lib/libXdamage.so /usr/lib/libXfixes.so /usr/lib/libXrandr.so /usr/lib/libXrender.so /usr/lib/libXinerama.so /usr/lib/libxslt.so -L/usr/lib /usr/lib/libxml2.so -lz /usr/lib/libstartup-notification-1.so /usr/lib/libSM.so /usr/lib/libICE.so /usr/lib/libxcb-xlib.so /usr/lib/libxcb.so /usr/lib/libXau.so /usr/lib/libXdmcp.so /usr/lib/libGL.so /usr/lib/libX11.so /usr/lib/libXext.so -ldl -lm
Making all in libdecoration
mkdir .libs
i586-pc-linux-gnu-gcc -DHAVE_CONFIG_H -I. -I.. -I../include -Os -march=i686 -Wall -Wpointer-arith -Wstrict-prototypes -Wmissing-prototypes -Wmissing-declarations -Wnested-externs -D_FORTIFY_SOURCE=2 -MT decoration.lo -MD -MP -MF .deps/decoration.Tpo -c decoration.c -fPIC -DPIC -o .libs/decoration.o
i586-pc-linux-gnu-gcc -DHAVE_CONFIG_H -I. -I.. -I../include -Os -march=i686 -Wall -Wpointer-arith -Wstrict-prototypes -Wmissing-prototypes -Wmissing-declarations -Wnested-externs -D_FORTIFY_SOURCE=2 -MT decoration.lo -MD -MP -MF .deps/decoration.Tpo -c decoration.c -o decoration.o >/dev/null 2>&1
i586-pc-linux-gnu-gcc -shared .libs/decoration.o /usr/lib/libXrender.so -L/usr/lib /usr/lib/libX11.so -lm -march=i686 -Wl,-soname -Wl,libdecoration.so.0 -o .libs/libdecoration.so.0.0.0
(cd .libs && rm -f libdecoration.so.0 && ln -s libdecoration.so.0.0.0 libdecoration.so.0)
(cd .libs && rm -f libdecoration.so && ln -s libdecoration.so.0.0.0 libdecoration.so)
i586-pc-linux-gnu-ar cru .libs/libdecoration.a decoration.o
i586-pc-linux-gnu-ranlib .libs/libdecoration.a
creating libdecoration.la
(cd .libs && rm -f libdecoration.la && ln -s ../libdecoration.la libdecoration.la)
Making all in plugins
mkdir .libs
i586-pc-linux-gnu-g++ -DHAVE_CONFIG_H -I. -I.. -I/usr/include/libxml2 -I/usr/include/startup-notification-1.0 -I/usr/include/libpng12 -pthread -DORBIT2=1 -I/usr/include/cairo -I/usr/include/freetype2 -I/usr/include/libpng12 -I/usr/include/librsvg-2 -I/usr/include/gnome-vfs-2.0 -I/usr/lib/gnome-vfs-2.0/include -I/usr/include/glib-2.0 -I/usr/lib/glib-2.0/include -I/usr/include/gtk-2.0 -I/usr/include/gconf/2 -I/usr/include/orbit-2.0 -I/usr/include/cairo -I/usr/include/freetype2 -I/usr/include/libpng12 -I/usr/qt/3/include -I -I/usr/include/glib-2.0 -I/usr/lib/glib-2.0/include -I/usr/include/dbus-1.0 -I/usr/lib/dbus-1.0/include -I/usr/include/libxml2 -DFUSE_USE_VERSION=26 "-DALL_LINGUAS=\"af ar bg be bn bn_IN bs ca cs cy da de el en_GB en_US es eu et fi fr gl gu he hi hr hu id it ja ka km ko lo lt mk mr nb nl or pa pl pt pt_BR ro ru sk sl sr sv ta tr uk vi xh zh_CN zh_TW zu\"" -DLOCALEDIR=\"/usr/share/locale\" -DPLUGINDIR=\"/usr/lib/compiz\" -DIMAGEDIR=\"/usr/share/compiz\" -I../include -DMETADATADIR=\"/usr/share/compiz\" -Os -march=i686 -Wall -D_FORTIFY_SOURCE=2 -MT kconfig.lo -MD -MP -MF .deps/kconfig.Tpo -c kconfig.cpp -fPIC -DPIC -o .libs/kconfig.o
i586-pc-linux-gnu-gcc -DHAVE_CONFIG_H -I. -I.. -I/usr/include/libxml2 -I/usr/include/startup-notification-1.0 -I/usr/include/libpng12 -pthread -DORBIT2=1 -I/usr/include/cairo -I/usr/include/freetype2 -I/usr/include/libpng12 -I/usr/include/librsvg-2 -I/usr/include/gnome-vfs-2.0 -I/usr/lib/gnome-vfs-2.0/include -I/usr/include/glib-2.0 -I/usr/lib/glib-2.0/include -I/usr/include/gtk-2.0 -I/usr/include/gconf/2 -I/usr/include/orbit-2.0 -I/usr/include/cairo -I/usr/include/freetype2 -I/usr/include/libpng12 -I/usr/qt/3/include -I -I/usr/include/glib-2.0 -I/usr/lib/glib-2.0/include -I/usr/include/dbus-1.0 -I/usr/lib/dbus-1.0/include -I/usr/include/libxml2 -DFUSE_USE_VERSION=26 "-DALL_LINGUAS=\"af ar bg be bn bn_IN bs ca cs cy da de el en_GB en_US es eu et fi fr gl gu he hi hr hu id it ja ka km ko lo lt mk mr nb nl or pa pl pt pt_BR ro ru sk sl sr sv ta tr uk vi xh zh_CN zh_TW zu\"" -DLOCALEDIR=\"/usr/share/locale\" -DPLUGINDIR=\"/usr/lib/compiz\" -DIMAGEDIR=\"/usr/share/compiz\" -I../include -DMETADATADIR=\"/usr/share/compiz\" -Os -march=i686 -Wall -Wpointer-arith -Wstrict-prototypes -Wmissing-prototypes -Wmissing-declarations -Wnested-externs -D_FORTIFY_SOURCE=2 -MT glib.lo -MD -MP -MF .deps/glib.Tpo -c glib.c -fPIC -DPIC -o .libs/glib.o
In file included from kconfig.cpp:20:
/usr/include/kglobal.h:21:28: error: kdelibs_export.h: No such file or directory
/usr/include/kglobal.h:22:63: error: kinstance.h: No such file or directory
i586-pc-linux-gnu-gcc -DHAVE_CONFIG_H -I. -I.. -I/usr/include/libxml2 -I/usr/include/startup-notification-1.0 -I/usr/include/libpng12 -pthread -DORBIT2=1 -I/usr/include/cairo -I/usr/include/freetype2 -I/usr/include/libpng12 -I/usr/include/librsvg-2 -I/usr/include/gnome-vfs-2.0 -I/usr/lib/gnome-vfs-2.0/include -I/usr/include/glib-2.0 -I/usr/lib/glib-2.0/include -I/usr/include/gtk-2.0 -I/usr/include/gconf/2 -I/usr/include/orbit-2.0 -I/usr/include/cairo -I/usr/include/freetype2 -I/usr/include/libpng12 -I/usr/qt/3/include -I -I/usr/include/glib-2.0 -I/usr/lib/glib-2.0/include -I/usr/include/dbus-1.0 -I/usr/lib/dbus-1.0/include -I/usr/include/libxml2 -DFUSE_USE_VERSION=26 "-DALL_LINGUAS=\"af ar bg be bn bn_IN bs ca cs cy da de el en_GB en_US es eu et fi fr gl gu he hi hr hu id it ja ka km ko lo lt mk mr nb nl or pa pl pt pt_BR ro ru sk sl sr sv ta tr uk vi xh zh_CN zh_TW zu\"" -DLOCALEDIR=\"/usr/share/locale\" -DPLUGINDIR=\"/usr/lib/compiz\" -DIMAGEDIR=\"/usr/share/compiz\" -I../include -DMETADATADIR=\"/usr/share/compiz\" -Os -march=i686 -Wall -Wpointer-arith -Wstrict-prototypes -Wmissing-prototypes -Wmissing-declarations -Wnested-externs -D_FORTIFY_SOURCE=2 -MT glib.lo -MD -MP -MF .deps/glib.Tpo -c glib.c -o glib.o >/dev/null 2>&1
In file included from kconfig.cpp:22:
/usr/include/kapplication.h:25:24: error: kdeversion.h: No such file or directory
In file included from kconfig.cpp:23:
/usr/include/ksimpleconfig.h:24:21: error: kconfig.h: No such file or directory
In file included from kconfig.cpp:20:
/usr/include/kglobal.h:44: error: function definition does not declare parameters
/usr/include/kglobal.h:219: error: expected initializer before 'kasciistricmp'
i586-pc-linux-gnu-gcc -DHAVE_CONFIG_H -I. -I.. -I/usr/include/libxml2 -I/usr/include/startup-notification-1.0 -I/usr/include/libpng12 -pthread -DORBIT2=1 -I/usr/include/cairo -I/usr/include/freetype2 -I/usr/include/libpng12 -I/usr/include/librsvg-2 -I/usr/include/gnome-vfs-2.0 -I/usr/lib/gnome-vfs-2.0/include -I/usr/include/glib-2.0 -I/usr/lib/glib-2.0/include -I/usr/include/gtk-2.0 -I/usr/include/gconf/2 -I/usr/include/orbit-2.0 -I/usr/include/cairo -I/usr/include/freetype2 -I/usr/include/libpng12 -I/usr/qt/3/include -I -I/usr/include/glib-2.0 -I/usr/lib/glib-2.0/include -I/usr/include/dbus-1.0 -I/usr/lib/dbus-1.0/include -I/usr/include/libxml2 -DFUSE_USE_VERSION=26 "-DALL_LINGUAS=\"af ar bg be bn bn_IN bs ca cs cy da de el en_GB en_US es eu et fi fr gl gu he hi hr hu id it ja ka km ko lo lt mk mr nb nl or pa pl pt pt_BR ro ru sk sl sr sv ta tr uk vi xh zh_CN zh_TW zu\"" -DLOCALEDIR=\"/usr/share/locale\" -DPLUGINDIR=\"/usr/lib/compiz\" -DIMAGEDIR=\"/usr/share/compiz\" -I../include -DMETADATADIR=\"/usr/share/compiz\" -Os -march=i686 -Wall -Wpointer-arith -Wstrict-prototypes -Wmissing-prototypes -Wmissing-declarations -Wnested-externs -D_FORTIFY_SOURCE=2 -MT decoration.lo -MD -MP -MF .deps/decoration.Tpo -c decoration.c -fPIC -DPIC -o .libs/decoration.o
In file included from kconfig.cpp:21:
/usr/include/kstandarddirs.h:125: error: function definition does not declare parameters
/usr/include/kstandarddirs.h:703: error: expected initializer before 'locate'
/usr/include/kstandarddirs.h:714: error: expected initializer before 'locateLocal'
/usr/include/kstandarddirs.h:725: error: expected initializer before 'locateLocal'
In file included from kconfig.cpp:22:
/usr/include/kapplication.h:94: error: function definition does not declare parameters
/usr/include/kapplication.h:1421: error: two or more data types in declaration of 'checkAccess'
/usr/include/kapplication.h:1441: error: function definition does not declare parameters
In file included from kconfig.cpp:23:
/usr/include/ksimpleconfig.h:41: error: function definition does not declare parameters
kconfig.cpp:30: error: expected initializer before '*' token
kconfig.cpp: In function 'int kconfigRcSync(void*)':
kconfig.cpp:63: error: invalid use of incomplete type 'struct KConfig'
/usr/include/kglobal.h:25: error: forward declaration of 'struct KConfig'
kconfig.cpp: In function 'void kconfigSetOption(CompObject*, CompOption*, const char*)':
kconfig.cpp:195: error: invalid use of incomplete type 'struct KConfig'
/usr/include/kglobal.h:25: error: forward declaration of 'struct KConfig'
kconfig.cpp:200: error: invalid use of incomplete type 'struct KConfig'
/usr/include/kglobal.h:25: error: forward declaration of 'struct KConfig'
kconfig.cpp:204: error: invalid use of incomplete type 'struct KConfig'
/usr/include/kglobal.h:25: error: forward declaration of 'struct KConfig'
kconfig.cpp:207: error: invalid use of incomplete type 'struct KConfig'
/usr/include/kglobal.h:25: error: forward declaration of 'struct KConfig'
kconfig.cpp:215: error: invalid use of incomplete type 'struct KConfig'
/usr/include/kglobal.h:25: error: forward declaration of 'struct KConfig'
kconfig.cpp:229: error: invalid use of incomplete type 'struct KConfig'
/usr/include/kglobal.h:25: error: forward declaration of 'struct KConfig'
kconfig.cpp:247: error: invalid use of incomplete type 'struct KConfig'
/usr/include/kglobal.h:25: error: forward declaration of 'struct KConfig'
kconfig.cpp: In function 'int kconfigReadOptionValue(CompObject*, KConfig*, CompOption*, CompOptionValue*)':
kconfig.cpp:342: error: invalid use of incomplete type 'struct KConfig'
/usr/include/kglobal.h:25: error: forward declaration of 'struct KConfig'
kconfig.cpp:345: error: invalid use of incomplete type 'struct KConfig'
/usr/include/kglobal.h:25: error: forward declaration of 'struct KConfig'
kconfig.cpp:348: error: invalid use of incomplete type 'struct KConfig'
/usr/include/kglobal.h:25: error: forward declaration of 'struct KConfig'
kconfig.cpp:357: error: invalid use of incomplete type 'struct KConfig'
/usr/include/kglobal.h:25: error: forward declaration of 'struct KConfig'
kconfig.cpp:372: error: invalid use of incomplete type 'struct KConfig'
/usr/include/kglobal.h:25: error: forward declaration of 'struct KConfig'
kconfig.cpp:399: error: invalid use of incomplete type 'struct KConfig'
/usr/include/kglobal.h:25: error: forward declaration of 'struct KConfig'
kconfig.cpp: In function 'void kconfigGetOption(CompObject*, CompOption*, const char*)':
kconfig.cpp:451: error: invalid use of incomplete type 'struct KConfig'
/usr/include/kglobal.h:25: error: forward declaration of 'struct KConfig'
kconfig.cpp:453: error: invalid use of incomplete type 'struct KConfig'
/usr/include/kglobal.h:25: error: forward declaration of 'struct KConfig'
kconfig.cpp: In function 'int kconfigRcReload(void*)':
kconfig.cpp:507: error: invalid use of incomplete type 'struct KConfig'
/usr/include/kglobal.h:25: error: forward declaration of 'struct KConfig'
kconfig.cpp: In function 'int kconfigInitCore(CompPlugin*, CompCore*)':
kconfig.cpp:608: error: invalid use of incomplete type 'struct KConfig'
/usr/include/kglobal.h:25: error: forward declaration of 'struct KConfig'
kconfig.cpp:619: error: 'KGlobal' has not been declared
kconfig.cpp: In function 'void kconfigFiniCore(CompPlugin*, CompCore*)':
kconfig.cpp:660: warning: possible problem detected in invocation of delete operator:
kconfig.cpp:660: warning: invalid use of incomplete type 'struct KConfig'
/usr/include/kglobal.h:25: warning: forward declaration of 'struct KConfig'
kconfig.cpp:660: note: neither the destructor nor the class-specific operator delete will be called, even if they are declared when the class is defined.
kconfig.cpp: In function 'int kconfigInit(CompPlugin*)':
kconfig.cpp:700: error: 'kInstance' was not declared in this scope
kconfig.cpp:700: error: expected type-specifier before 'KInstance'
kconfig.cpp:700: error: expected `;' before 'KInstance'
kconfig.cpp: In function 'void kconfigFini(CompPlugin*)':
kconfig.cpp:716: error: 'kInstance' was not declared in this scope
make[2]: *** [kconfig.lo] Error 1
make[2]: *** Waiting for unfinished jobs....
i586-pc-linux-gnu-gcc -DHAVE_CONFIG_H -I. -I.. -I/usr/include/libxml2 -I/usr/include/startup-notification-1.0 -I/usr/include/libpng12 -pthread -DORBIT2=1 -I/usr/include/cairo -I/usr/include/freetype2 -I/usr/include/libpng12 -I/usr/include/librsvg-2 -I/usr/include/gnome-vfs-2.0 -I/usr/lib/gnome-vfs-2.0/include -I/usr/include/glib-2.0 -I/usr/lib/glib-2.0/include -I/usr/include/gtk-2.0 -I/usr/include/gconf/2 -I/usr/include/orbit-2.0 -I/usr/include/cairo -I/usr/include/freetype2 -I/usr/include/libpng12 -I/usr/qt/3/include -I -I/usr/include/glib-2.0 -I/usr/lib/glib-2.0/include -I/usr/include/dbus-1.0 -I/usr/lib/dbus-1.0/include -I/usr/include/libxml2 -DFUSE_USE_VERSION=26 "-DALL_LINGUAS=\"af ar bg be bn bn_IN bs ca cs cy da de el en_GB en_US es eu et fi fr gl gu he hi hr hu id it ja ka km ko lo lt mk mr nb nl or pa pl pt pt_BR ro ru sk sl sr sv ta tr uk vi xh zh_CN zh_TW zu\"" -DLOCALEDIR=\"/usr/share/locale\" -DPLUGINDIR=\"/usr/lib/compiz\" -DIMAGEDIR=\"/usr/share/compiz\" -I../include -DMETADATADIR=\"/usr/share/compiz\" -Os -march=i686 -Wall -Wpointer-arith -Wstrict-prototypes -Wmissing-prototypes -Wmissing-declarations -Wnested-externs -D_FORTIFY_SOURCE=2 -MT decoration.lo -MD -MP -MF .deps/decoration.Tpo -c decoration.c -o decoration.o >/dev/null 2>&1
make[1]: *** [all-recursive] Error 1
make: *** [all] Error 2

!!! ERROR in x11-wm/compiz-9999:
!!! In src_compile at line 3835
!!! make failed

!!! Call stack:
!!! * src_compile (/var/tmp/paludis/x11-wm/compiz-9999/temp/loadsaveenv:3835)
!!! * ebuild_f_compile (/usr/libexec/paludis/1/src_compile.bash:51)
!!! * ebuild_main (/usr/libexec/paludis/ebuild.bash:485)
!!! * main (/usr/libexec/paludis/ebuild.bash:503)

diefunc: making ebuild PID 10211 exit with error
die trap: exiting with error.

Install error:
* In program paludis -Ui compiz:
* When performing install action from command line:
* When executing install task:
* When installing 'x11-wm/compiz-9999:0::x-arcon-overlay':
* Install error: Install failed for 'x11-wm/compiz-9999:0::x-arcon-overlay'



Resume command: paludis --log-level qa --install --add-to-world-spec '( x11-wm/compiz )' --dl-deps-default discard '=x11-wm/compiz-9999:0::x-arcon-overlay'

I checked and all the kde-headers files are in there places: in /usr/kde/3.5/include and /usr/kde/4.0/include. i have reinstalled kdelibs-3.5 and 4.0 (in case they could be the problem), but still nothing. I do not get any error when i try to install compiz-0.6.2-r1 from gentoo. As you see I use paludis ... But this doesn't affect the installation as the same error pops when installing with emerge (normal to me as the program you use to install doesn't usually affect the making process)
I'm waiting for your help. :alien:
FuzZy2006
Young Hen
 
Posts: 24
Joined: Thu Nov 30, 2006 15:00

Re: Failure during the make of compiz-9999:arcon

Postby wolfden » Thu Jan 31, 2008 15:55

You need to start over with this guide:
viewtopic.php?f=53&t=9882

you have to check that guide often as it changes frequently

remove arcon overlay

plus your using paludis? We can't really support that.
wolfden
Sharecropper
 
Posts: 9050
Joined: Sat Jan 14, 2006 0:55
Location: Midwest USA

Re: Failure during the make of compiz-9999:arcon

Postby FuzZy2006 » Fri Feb 01, 2008 11:06

Installing from the desktop-effects overlay: i get the same error. Nothing changes:
make -j2 -s
Making all in include
Making all in src
mkdir .libs
i586-pc-linux-gnu-gcc -Os -march=i686 -Wall -Wpointer-arith -Wstrict-prototypes -Wmissing-prototypes -Wmissing-declarations -Wnested-externs -D_FORTIFY_SOURCE=2 -o compiz main.o privates.o object.o core.o texture.o display.o screen.o window.o event.o paint.o option.o plugin.o session.o fragment.o matrix.o cursor.o match.o metadata.o -Wl,--export-dynamic /usr/lib/libX11-xcb.so /usr/lib/libXcomposite.so /usr/lib/libXdamage.so /usr/lib/libXfixes.so /usr/lib/libXrandr.so /usr/lib/libXrender.so /usr/lib/libXinerama.so /usr/lib/libxslt.so -L/usr/lib /usr/lib/libxml2.so -lz /usr/lib/libstartup-notification-1.so /usr/lib/libSM.so /usr/lib/libICE.so /usr/lib/libxcb-xlib.so /usr/lib/libxcb.so /usr/lib/libXau.so /usr/lib/libXdmcp.so /usr/lib/libGL.so /usr/lib/libX11.so /usr/lib/libXext.so -ldl -lm
Making all in libdecoration
mkdir .libs
i586-pc-linux-gnu-gcc -DHAVE_CONFIG_H -I. -I.. -I../include -Os -march=i686 -Wall -Wpointer-arith -Wstrict-prototypes -Wmissing-prototypes -Wmissing-declarations -Wnested-externs -D_FORTIFY_SOURCE=2 -MT decoration.lo -MD -MP -MF .deps/decoration.Tpo -c decoration.c -fPIC -DPIC -o .libs/decoration.o
i586-pc-linux-gnu-gcc -DHAVE_CONFIG_H -I. -I.. -I../include -Os -march=i686 -Wall -Wpointer-arith -Wstrict-prototypes -Wmissing-prototypes -Wmissing-declarations -Wnested-externs -D_FORTIFY_SOURCE=2 -MT decoration.lo -MD -MP -MF .deps/decoration.Tpo -c decoration.c -o decoration.o >/dev/null 2>&1
i586-pc-linux-gnu-gcc -shared .libs/decoration.o /usr/lib/libXrender.so -L/usr/lib /usr/lib/libX11.so -lm -march=i686 -Wl,-soname -Wl,libdecoration.so.0 -o .libs/libdecoration.so.0.0.0
(cd .libs && rm -f libdecoration.so.0 && ln -s libdecoration.so.0.0.0 libdecoration.so.0)
(cd .libs && rm -f libdecoration.so && ln -s libdecoration.so.0.0.0 libdecoration.so)
i586-pc-linux-gnu-ar cru .libs/libdecoration.a decoration.o
i586-pc-linux-gnu-ranlib .libs/libdecoration.a
creating libdecoration.la
(cd .libs && rm -f libdecoration.la && ln -s ../libdecoration.la libdecoration.la)
Making all in plugins
mkdir .libs
i586-pc-linux-gnu-g++ -DHAVE_CONFIG_H -I. -I.. -I/usr/include/libxml2 -I/usr/include/startup-notification-1.0 -I/usr/include/libpng12 -pthread -DORBIT2=1 -I/usr/include/cairo -I/usr/include/freetype2 -I/usr/include/libpng12 -I/usr/include/librsvg-2 -I/usr/include/gnome-vfs-2.0 -I/usr/lib/gnome-vfs-2.0/include -I/usr/include/glib-2.0 -I/usr/lib/glib-2.0/include -I/usr/include/gtk-2.0 -I/usr/include/gconf/2 -I/usr/include/orbit-2.0 -I/usr/include/cairo -I/usr/include/freetype2 -I/usr/include/libpng12 -I/usr/qt/3/include -I -I/usr/include/glib-2.0 -I/usr/lib/glib-2.0/include -I/usr/include/dbus-1.0 -I/usr/lib/dbus-1.0/include -I/usr/include/libxml2 -DFUSE_USE_VERSION=26 "-DALL_LINGUAS=\"af ar bg be bn bn_IN bs ca cs cy da de el en_GB en_US es eu et fi fr gl gu he hi hr hu id it ja ka km ko lo lt mk mr nb nl or pa pl pt pt_BR ro ru sk sl sr sv ta tr uk vi xh zh_CN zh_TW zu\"" -DLOCALEDIR=\"/usr/share/locale\" -DPLUGINDIR=\"/usr/lib/compiz\" -DIMAGEDIR=\"/usr/share/compiz\" -I../include -DMETADATADIR=\"/usr/share/compiz\" -Os -march=i686 -Wall -D_FORTIFY_SOURCE=2 -MT kconfig.lo -MD -MP -MF .deps/kconfig.Tpo -c kconfig.cpp -fPIC -DPIC -o .libs/kconfig.o
i586-pc-linux-gnu-gcc -DHAVE_CONFIG_H -I. -I.. -I/usr/include/libxml2 -I/usr/include/startup-notification-1.0 -I/usr/include/libpng12 -pthread -DORBIT2=1 -I/usr/include/cairo -I/usr/include/freetype2 -I/usr/include/libpng12 -I/usr/include/librsvg-2 -I/usr/include/gnome-vfs-2.0 -I/usr/lib/gnome-vfs-2.0/include -I/usr/include/glib-2.0 -I/usr/lib/glib-2.0/include -I/usr/include/gtk-2.0 -I/usr/include/gconf/2 -I/usr/include/orbit-2.0 -I/usr/include/cairo -I/usr/include/freetype2 -I/usr/include/libpng12 -I/usr/qt/3/include -I -I/usr/include/glib-2.0 -I/usr/lib/glib-2.0/include -I/usr/include/dbus-1.0 -I/usr/lib/dbus-1.0/include -I/usr/include/libxml2 -DFUSE_USE_VERSION=26 "-DALL_LINGUAS=\"af ar bg be bn bn_IN bs ca cs cy da de el en_GB en_US es eu et fi fr gl gu he hi hr hu id it ja ka km ko lo lt mk mr nb nl or pa pl pt pt_BR ro ru sk sl sr sv ta tr uk vi xh zh_CN zh_TW zu\"" -DLOCALEDIR=\"/usr/share/locale\" -DPLUGINDIR=\"/usr/lib/compiz\" -DIMAGEDIR=\"/usr/share/compiz\" -I../include -DMETADATADIR=\"/usr/share/compiz\" -Os -march=i686 -Wall -Wpointer-arith -Wstrict-prototypes -Wmissing-prototypes -Wmissing-declarations -Wnested-externs -D_FORTIFY_SOURCE=2 -MT glib.lo -MD -MP -MF .deps/glib.Tpo -c glib.c -fPIC -DPIC -o .libs/glib.o
In file included from kconfig.cpp:20:
/usr/include/kglobal.h:21:28: error: kdelibs_export.h: No such file or directory
/usr/include/kglobal.h:22:63: error: kinstance.h: No such file or directory
i586-pc-linux-gnu-gcc -DHAVE_CONFIG_H -I. -I.. -I/usr/include/libxml2 -I/usr/include/startup-notification-1.0 -I/usr/include/libpng12 -pthread -DORBIT2=1 -I/usr/include/cairo -I/usr/include/freetype2 -I/usr/include/libpng12 -I/usr/include/librsvg-2 -I/usr/include/gnome-vfs-2.0 -I/usr/lib/gnome-vfs-2.0/include -I/usr/include/glib-2.0 -I/usr/lib/glib-2.0/include -I/usr/include/gtk-2.0 -I/usr/include/gconf/2 -I/usr/include/orbit-2.0 -I/usr/include/cairo -I/usr/include/freetype2 -I/usr/include/libpng12 -I/usr/qt/3/include -I -I/usr/include/glib-2.0 -I/usr/lib/glib-2.0/include -I/usr/include/dbus-1.0 -I/usr/lib/dbus-1.0/include -I/usr/include/libxml2 -DFUSE_USE_VERSION=26 "-DALL_LINGUAS=\"af ar bg be bn bn_IN bs ca cs cy da de el en_GB en_US es eu et fi fr gl gu he hi hr hu id it ja ka km ko lo lt mk mr nb nl or pa pl pt pt_BR ro ru sk sl sr sv ta tr uk vi xh zh_CN zh_TW zu\"" -DLOCALEDIR=\"/usr/share/locale\" -DPLUGINDIR=\"/usr/lib/compiz\" -DIMAGEDIR=\"/usr/share/compiz\" -I../include -DMETADATADIR=\"/usr/share/compiz\" -Os -march=i686 -Wall -Wpointer-arith -Wstrict-prototypes -Wmissing-prototypes -Wmissing-declarations -Wnested-externs -D_FORTIFY_SOURCE=2 -MT glib.lo -MD -MP -MF .deps/glib.Tpo -c glib.c -o glib.o >/dev/null 2>&1
In file included from kconfig.cpp:22:
/usr/include/kapplication.h:25:24: error: kdeversion.h: No such file or directory
In file included from kconfig.cpp:23:
/usr/include/ksimpleconfig.h:24:21: error: kconfig.h: No such file or directory
In file included from kconfig.cpp:20:
/usr/include/kglobal.h:44: error: function definition does not declare parameters
/usr/include/kglobal.h:219: error: expected initializer before 'kasciistricmp'
In file included from kconfig.cpp:21:
/usr/include/kstandarddirs.h:125: error: function definition does not declare parameters
/usr/include/kstandarddirs.h:703: error: expected initializer before 'locate'
/usr/include/kstandarddirs.h:714: error: expected initializer before 'locateLocal'
/usr/include/kstandarddirs.h:725: error: expected initializer before 'locateLocal'
i586-pc-linux-gnu-gcc -DHAVE_CONFIG_H -I. -I.. -I/usr/include/libxml2 -I/usr/include/startup-notification-1.0 -I/usr/include/libpng12 -pthread -DORBIT2=1 -I/usr/include/cairo -I/usr/include/freetype2 -I/usr/include/libpng12 -I/usr/include/librsvg-2 -I/usr/include/gnome-vfs-2.0 -I/usr/lib/gnome-vfs-2.0/include -I/usr/include/glib-2.0 -I/usr/lib/glib-2.0/include -I/usr/include/gtk-2.0 -I/usr/include/gconf/2 -I/usr/include/orbit-2.0 -I/usr/include/cairo -I/usr/include/freetype2 -I/usr/include/libpng12 -I/usr/qt/3/include -I -I/usr/include/glib-2.0 -I/usr/lib/glib-2.0/include -I/usr/include/dbus-1.0 -I/usr/lib/dbus-1.0/include -I/usr/include/libxml2 -DFUSE_USE_VERSION=26 "-DALL_LINGUAS=\"af ar bg be bn bn_IN bs ca cs cy da de el en_GB en_US es eu et fi fr gl gu he hi hr hu id it ja ka km ko lo lt mk mr nb nl or pa pl pt pt_BR ro ru sk sl sr sv ta tr uk vi xh zh_CN zh_TW zu\"" -DLOCALEDIR=\"/usr/share/locale\" -DPLUGINDIR=\"/usr/lib/compiz\" -DIMAGEDIR=\"/usr/share/compiz\" -I../include -DMETADATADIR=\"/usr/share/compiz\" -Os -march=i686 -Wall -Wpointer-arith -Wstrict-prototypes -Wmissing-prototypes -Wmissing-declarations -Wnested-externs -D_FORTIFY_SOURCE=2 -MT decoration.lo -MD -MP -MF .deps/decoration.Tpo -c decoration.c -fPIC -DPIC -o .libs/decoration.o
In file included from kconfig.cpp:22:
/usr/include/kapplication.h:94: error: function definition does not declare parameters
/usr/include/kapplication.h:1421: error: two or more data types in declaration of 'checkAccess'
/usr/include/kapplication.h:1441: error: function definition does not declare parameters
In file included from kconfig.cpp:23:
/usr/include/ksimpleconfig.h:41: error: function definition does not declare parameters
kconfig.cpp:30: error: expected initializer before '*' token
kconfig.cpp: In function 'int kconfigRcSync(void*)':
kconfig.cpp:63: error: invalid use of incomplete type 'struct KConfig'
/usr/include/kglobal.h:25: error: forward declaration of 'struct KConfig'
kconfig.cpp: In function 'void kconfigSetOption(CompObject*, CompOption*, const char*)':
kconfig.cpp:195: error: invalid use of incomplete type 'struct KConfig'
/usr/include/kglobal.h:25: error: forward declaration of 'struct KConfig'
kconfig.cpp:200: error: invalid use of incomplete type 'struct KConfig'
/usr/include/kglobal.h:25: error: forward declaration of 'struct KConfig'
kconfig.cpp:204: error: invalid use of incomplete type 'struct KConfig'
/usr/include/kglobal.h:25: error: forward declaration of 'struct KConfig'
kconfig.cpp:207: error: invalid use of incomplete type 'struct KConfig'
/usr/include/kglobal.h:25: error: forward declaration of 'struct KConfig'
kconfig.cpp:215: error: invalid use of incomplete type 'struct KConfig'
/usr/include/kglobal.h:25: error: forward declaration of 'struct KConfig'
kconfig.cpp:229: error: invalid use of incomplete type 'struct KConfig'
/usr/include/kglobal.h:25: error: forward declaration of 'struct KConfig'
kconfig.cpp:247: error: invalid use of incomplete type 'struct KConfig'
/usr/include/kglobal.h:25: error: forward declaration of 'struct KConfig'
kconfig.cpp: In function 'int kconfigReadOptionValue(CompObject*, KConfig*, CompOption*, CompOptionValue*)':
kconfig.cpp:342: error: invalid use of incomplete type 'struct KConfig'
/usr/include/kglobal.h:25: error: forward declaration of 'struct KConfig'
kconfig.cpp:345: error: invalid use of incomplete type 'struct KConfig'
/usr/include/kglobal.h:25: error: forward declaration of 'struct KConfig'
kconfig.cpp:348: error: invalid use of incomplete type 'struct KConfig'
/usr/include/kglobal.h:25: error: forward declaration of 'struct KConfig'
kconfig.cpp:357: error: invalid use of incomplete type 'struct KConfig'
/usr/include/kglobal.h:25: error: forward declaration of 'struct KConfig'
kconfig.cpp:372: error: invalid use of incomplete type 'struct KConfig'
/usr/include/kglobal.h:25: error: forward declaration of 'struct KConfig'
kconfig.cpp:399: error: invalid use of incomplete type 'struct KConfig'
/usr/include/kglobal.h:25: error: forward declaration of 'struct KConfig'
kconfig.cpp: In function 'void kconfigGetOption(CompObject*, CompOption*, const char*)':
kconfig.cpp:451: error: invalid use of incomplete type 'struct KConfig'
/usr/include/kglobal.h:25: error: forward declaration of 'struct KConfig'
kconfig.cpp:453: error: invalid use of incomplete type 'struct KConfig'
/usr/include/kglobal.h:25: error: forward declaration of 'struct KConfig'
kconfig.cpp: In function 'int kconfigRcReload(void*)':
kconfig.cpp:507: error: invalid use of incomplete type 'struct KConfig'
/usr/include/kglobal.h:25: error: forward declaration of 'struct KConfig'
kconfig.cpp: In function 'int kconfigInitCore(CompPlugin*, CompCore*)':
kconfig.cpp:608: error: invalid use of incomplete type 'struct KConfig'
/usr/include/kglobal.h:25: error: forward declaration of 'struct KConfig'
kconfig.cpp:619: error: 'KGlobal' has not been declared
kconfig.cpp: In function 'void kconfigFiniCore(CompPlugin*, CompCore*)':
kconfig.cpp:660: warning: possible problem detected in invocation of delete operator:
kconfig.cpp:660: warning: invalid use of incomplete type 'struct KConfig'
/usr/include/kglobal.h:25: warning: forward declaration of 'struct KConfig'
kconfig.cpp:660: note: neither the destructor nor the class-specific operator delete will be called, even if they are declared when the class is defined.
kconfig.cpp: In function 'int kconfigInit(CompPlugin*)':
kconfig.cpp:700: error: 'kInstance' was not declared in this scope
kconfig.cpp:700: error: expected type-specifier before 'KInstance'
kconfig.cpp:700: error: expected `;' before 'KInstance'
kconfig.cpp: In function 'void kconfigFini(CompPlugin*)':
kconfig.cpp:716: error: 'kInstance' was not declared in this scope
make[2]: *** [kconfig.lo] Error 1
make[2]: *** Waiting for unfinished jobs....
i586-pc-linux-gnu-gcc -DHAVE_CONFIG_H -I. -I.. -I/usr/include/libxml2 -I/usr/include/startup-notification-1.0 -I/usr/include/libpng12 -pthread -DORBIT2=1 -I/usr/include/cairo -I/usr/include/freetype2 -I/usr/include/libpng12 -I/usr/include/librsvg-2 -I/usr/include/gnome-vfs-2.0 -I/usr/lib/gnome-vfs-2.0/include -I/usr/include/glib-2.0 -I/usr/lib/glib-2.0/include -I/usr/include/gtk-2.0 -I/usr/include/gconf/2 -I/usr/include/orbit-2.0 -I/usr/include/cairo -I/usr/include/freetype2 -I/usr/include/libpng12 -I/usr/qt/3/include -I -I/usr/include/glib-2.0 -I/usr/lib/glib-2.0/include -I/usr/include/dbus-1.0 -I/usr/lib/dbus-1.0/include -I/usr/include/libxml2 -DFUSE_USE_VERSION=26 "-DALL_LINGUAS=\"af ar bg be bn bn_IN bs ca cs cy da de el en_GB en_US es eu et fi fr gl gu he hi hr hu id it ja ka km ko lo lt mk mr nb nl or pa pl pt pt_BR ro ru sk sl sr sv ta tr uk vi xh zh_CN zh_TW zu\"" -DLOCALEDIR=\"/usr/share/locale\" -DPLUGINDIR=\"/usr/lib/compiz\" -DIMAGEDIR=\"/usr/share/compiz\" -I../include -DMETADATADIR=\"/usr/share/compiz\" -Os -march=i686 -Wall -Wpointer-arith -Wstrict-prototypes -Wmissing-prototypes -Wmissing-declarations -Wnested-externs -D_FORTIFY_SOURCE=2 -MT decoration.lo -MD -MP -MF .deps/decoration.Tpo -c decoration.c -o decoration.o >/dev/null 2>&1
make[1]: *** [all-recursive] Error 1
make: *** [all] Error 2
FuzZy2006
Young Hen
 
Posts: 24
Joined: Thu Nov 30, 2006 15:00


Return to 3D Desktops and Window Managers

Who is online

Users browsing this forum: No registered users and 1 guest

cron