RC2 Mini nn riesco ad installare openoffice

Tutto ciò che è pertinente a Sabayon Linux, indipendentemente dall'architettura e dall'ambiente grafico

Moderator: Moderators

RC2 Mini nn riesco ad installare openoffice

Postby andriu » Sat Sep 02, 2006 1:48

questo è il log di errore:

Code: Select all
Emerge pretend app-office/openoffice started...
These are the packages that would be merged, in order:
Calculating dependencies ... done!
[ebuild N ] dev-java/ant-core [1.6.5-r13] USE="-doc -source" 0 kB
[ebuild N ] app-text/hunspell [1.1.4-r2] USE="ncurses nls readline" 0 kB
[ebuild N ] app-office/openoffice [2.0.3] USE="cairo eds firefox gnome gtk java kde mono pam xml -binfilter -debug -ldap -odk" LINGUAS="da de el en en_GB es fi fr hu it ja lt nb nl pl pt ru sk sl sv zh_CN -af -ar -be_BY -bg -bn -bs -ca -cs -cy -en_US -en_ZA -et -fa -gu_IN -he -hi_IN -hr -km -ko -mk -nn -nr -ns -pa_IN -pt_BR -rw -sh_YU -sr_CS -st -sw_TZ -th -tn -tr -ts -vi -xh -zh_TW -zu" 0 kB
Total size of downloads: 0 kB

Emerge --oneshot app-office/openoffice started...
Started emerge on: Sep 02, 2006 02:45:05
emerge --nospinner --columns --nocolor --oneshot app-office/openoffice
Calculating dependencies ... done!
>>> starting parallel fetching
(1 of 3) Cleaning dev-java/ant-core-1.6.5-r13
(1 of 3) Compiling/Merging dev-java/ant-core-1.6.5-r13
Traceback (most recent call last):
File "/usr/bin/depend-java-query", line 85, in ?
(options, args) = parser.parse_args()
File "/usr/lib/python2.4/optparse.py", line 1275, in parse_args
stop = self._process_args(largs, rargs, values)
File "/usr/lib/python2.4/optparse.py", line 1315, in _process_args
self._process_long_opt(rargs, values)
File "/usr/lib/python2.4/optparse.py", line 1390, in _process_long_opt
option.process(opt, value, values, self)
File "/usr/lib/python2.4/optparse.py", line 707, in process
return self.take_action(
File "/usr/lib/python2.4/optparse.py", line 726, in take_action
self.callback(self, opt, value, parser, *args, **kwargs)
File "/usr/bin/depend-java-query", line 49, in get_vm
vm = verman.get_vm(value)
File "/usr/share/java-config-2/pym/java_config/VersionManager.py", line 131, in get_vm
raise Exception("Couldn't find suitable VM. Possible invalid dependency string.")
Exception: Couldn't find suitable VM. Possible invalid dependency string.
[31;06m!!! ERROR: The active vm could not be found
[31;06m!!! ERROR: The active vm could not be found
[31;06m!!! ERROR: The active vm could not be found
[31;06m!!! ERROR: The active vm could not be found
[31;06m!!! ERROR: The active vm could not be found
[31;06m!!! ERROR: The active vm could not be found
[31;06m!!! ERROR: The active vm could not be found
Traceback (most recent call last):
File "/usr/bin/depend-java-query", line 85, in ?
(options, args) = parser.parse_args()
File "/usr/lib/python2.4/optparse.py", line 1275, in parse_args
stop = self._process_args(largs, rargs, values)
File "/usr/lib/python2.4/optparse.py", line 1315, in _process_args
self._process_long_opt(rargs, values)
File "/usr/lib/python2.4/optparse.py", line 1390, in _process_long_opt
option.process(opt, value, values, self)
File "/usr/lib/python2.4/optparse.py", line 707, in process
return self.take_action(
File "/usr/lib/python2.4/optparse.py", line 726, in take_action
self.callback(self, opt, value, parser, *args, **kwargs)
File "/usr/bin/depend-java-query", line 49, in get_vm
vm = verman.get_vm(value)
File "/usr/share/java-config-2/pym/java_config/VersionManager.py", line 131, in get_vm
raise Exception("Couldn't find suitable VM. Possible invalid dependency string.")
Exception: Couldn't find suitable VM. Possible invalid dependency string.
[31;06m!!! ERROR: The active vm could not be found
[31;06m!!! ERROR: The active vm could not be found
[31;06m!!! ERROR: The active vm could not be found
[31;06m!!! ERROR: The active vm could not be found
[31;06m!!! ERROR: The active vm could not be found
[31;06m!!! ERROR: The active vm could not be found
[31;06m!!! ERROR: The active vm could not be found
[31;06m!!! ERROR: The active vm could not be found
* Using:
>>> Unpacking source...
>>> Unpacking apache-ant-1.6.5-src.tar.bz2 to /var/tmp/portage/ant-core-1.6.5-r13/work
* Applying build.sh-exit-fix.patch ...
[ ok ]
>>> Source unpacked.
Rewriting ./build.xml
Rewriting ./src/etc/testcases/core/include/included_file_parse_error/build.xml
Rewriting ./src/etc/testcases/core/include/included_file_task_error/build.xml
Rewriting ./src/etc/testcases/core/include/including_file_task_error/build.xml
Rewriting ./src/etc/testcases/core/include/including_file_parse_error/build.xml
Rewriting ./src/etc/testcases/taskdefs/style/build.xml
Rewriting ./src/etc/testcases/taskdefs/fixcrlf/build.xml
Rewriting ./src/etc/testcases/filters/build.xml
Traceback (most recent call last):
File "/usr/bin/depend-java-query", line 85, in ?
(options, args) = parser.parse_args()
File "/usr/lib/python2.4/optparse.py", line 1275, in parse_args
stop = self._process_args(largs, rargs, values)
File "/usr/lib/python2.4/optparse.py", line 1315, in _process_args
self._process_long_opt(rargs, values)
File "/usr/lib/python2.4/optparse.py", line 1390, in _process_long_opt
option.process(opt, value, values, self)
File "/usr/lib/python2.4/optparse.py", line 707, in process
return self.take_action(
File "/usr/lib/python2.4/optparse.py", line 726, in take_action
self.callback(self, opt, value, parser, *args, **kwargs)
File "/usr/bin/depend-java-query", line 49, in get_vm
vm = verman.get_vm(value)
File "/usr/share/java-config-2/pym/java_config/VersionManager.py", line 131, in get_vm
raise Exception("Couldn't find suitable VM. Possible invalid dependency string.")
Exception: Couldn't find suitable VM. Possible invalid dependency string.
[31;06m!!! ERROR: The active vm could not be found
[31;06m!!! ERROR: The active vm could not be found
[31;06m!!! ERROR: The active vm could not be found
[31;06m!!! ERROR: The active vm could not be found
[31;06m!!! ERROR: The active vm could not be found
[31;06m!!! ERROR: The active vm could not be found
[31;06m!!! ERROR: The active vm could not be found
>>> Compiling source in /var/tmp/portage/ant-core-1.6.5-r13/work/apache-ant-1.6.5 ...
Warning: JAVA_HOME environment variable not set.
If build fails because sun.* classes could not be found
you will need to set the JAVA_HOME environment variable
to the installation directory of java.
Error: JAVA_HOME is not defined correctly.
We cannot execute java
Bootstrap FAILED
!!! ERROR: dev-java/ant-core-1.6.5-r13 failed.
Call stack:
ebuild.sh, line 1543: Called dyn_compile
ebuild.sh, line 938: Called src_compile
ant-core-1.6.5-r13.ebuild, line 41: Called die
!!! failed to build
!!! If you need support, post the topmost build error, and the call stack if relevant.
!!! When you file a bug report, please include the following information:
GENTOO_VM= CLASSPATH="" JAVA_HOME=""
JAVACFLAGS="-target 1.4" COMPILER=""
and of course, the output of emerge --info
... done!
>>> starting parallel fetching
>>> Emerging (1 of 3) dev-java/ant-core-1.6.5-r13 to /
* apache-ant-1.6.5-src.tar.bz2 MD5 ;-) ... [ ok ]
* apache-ant-1.6.5-src.tar.bz2 RMD160 ;-) ... [ ok ]
* apache-ant-1.6.5-src.tar.bz2 SHA1 ;-) ... [ ok ]
* apache-ant-1.6.5-src.tar.bz2 SHA256 ;-) ... [ ok ]
* apache-ant-1.6.5-src.tar.bz2 size ;-) ... [ ok ]
* checking ebuild checksums ;-) ... [ ok ]
* checking auxfile checksums ;-) ... [ ok ]
* checking miscfile checksums ;-) ... [ ok ]
* checking apache-ant-1.6.5-src.tar.bz2 ;-) ... [ ok ]
Done.


sapete spiegarmi come posso fare?

CIAO
andriu
Young Hen
 
Posts: 31
Joined: Mon Aug 21, 2006 10:47

Postby Dark_MaGe » Sat Sep 02, 2006 16:52

quello che ti chiede è di usare un java-vm, quindi installa prima java
Code: Select all
emerge sun-jdk
Dark_MaGe
Your Farmer
 
Posts: 1699
Joined: Thu Jun 29, 2006 8:19
Location: Catania Italy

Postby lxnay » Sat Sep 02, 2006 17:26

e poi:
Code: Select all
java-config -S 1


ciao :)
Image
Join us on IRC (chat.freenode.net #sabayon or WebChat)
Submit bugs to our Bug Tracker
Follow me on Twitter
Add me on Facebook
Add me on Google+
lxnay
Land Owner
 
Posts: 3596
Joined: Thu Oct 13, 2005 23:16
Location: Italy

Postby Dark_MaGe » Sat Sep 02, 2006 17:56

lxnay wrote:e poi:
Code: Select all
java-config -S 1


ciao :)
si in effetti mi sembrava di aver dimenticato qualcosa..... :oops: :oops: :oops:
Dark_MaGe
Your Farmer
 
Posts: 1699
Joined: Thu Jun 29, 2006 8:19
Location: Catania Italy

Postby andriu » Sun Sep 03, 2006 20:40

Sarà fatto!!! siete troooopo avantiiiiii ;-)
CIAUUU
andriu
Young Hen
 
Posts: 31
Joined: Mon Aug 21, 2006 10:47


Return to Sabayon Linux Discussioni Generali

Who is online

Users browsing this forum: No registered users and 1 guest