Error compiling Mesa

Compiz, KDE, Gnome, Fluxbox, etc...

Moderator: Moderators

Error compiling Mesa

Postby mrgarrison » Wed Oct 31, 2007 16:37

Hello everyone,

I have an error when i try to compilling Mesa 6 OR Mesa-7.

Code: Select all
makedepend: warning:  ../../common/driverfuncs.c (reading /usr/include/gentoo-multilib/amd64/limits.h, line 125): cannot find include file "limits.h"
makedepend: warning:  ../../common/driverfuncs.c (reading /usr/include/gentoo-multilib/amd64/stdlib.h, line 33): cannot find include file "stddef.h"
        not in /usr/lib/gcc/x86_64-pc-linux-gnu/4.1.2:/usr/lib/gcc/x86_64-pc-linux-gnu/4.1.2/32/include/stddef.h
        not in ./stddef.h
        not in ../../../../../src/mesa/drivers/dri/common/stddef.h
        not in server/stddef.h
        not in ../../../../../include/stddef.h
        not in ../../../../../include/GL/internal/stddef.h
        not in ../../../../../src/mesa/stddef.h
        not in ../../../../../src/mesa/main/stddef.h
        not in ../../../../../src/mesa/glapi/stddef.h
        not in ../../../../../src/mesa/math/stddef.h
        not in ../../../../../src/mesa/transform/stddef.h
        not in ../../../../../src/mesa/shader/stddef.h
        not in ../../../../../src/mesa/swrast/stddef.h
        not in ../../../../../src/mesa/swrast_setup/stddef.h
        not in ../../../../../src/egl/main/stddef.h
        not in ../../../../../src/egl/drivers/dri/stddef.h
        not in /usr/include/drm/stddef.h
        not in /usr/include/stddef.h
makedepend: warning:  ../../common/driverfuncs.c (reading /usr/include/gentoo-multilib/amd64/sys/types.h, line 147): cannot find include file "stddef.h"
        not in /usr/lib/gcc/x86_64-pc-linux-gnu/4.1.2:/usr/lib/gcc/x86_64-pc-linux-gnu/4.1.2/32/include/stddef.h
        not in ./stddef.h
        not in ../../../../../src/mesa/drivers/dri/common/stddef.h
        not in server/stddef.h
        not in ../../../../../include/stddef.h
        not in ../../../../../include/GL/internal/stddef.h
        not in ../../../../../src/mesa/stddef.h
        not in ../../../../../src/mesa/main/stddef.h
        not in ../../../../../src/mesa/glapi/stddef.h
        not in ../../../../../src/mesa/math/stddef.h
        not in ../../../../../src/mesa/transform/stddef.h
        not in ../../../../../src/mesa/shader/stddef.h
        not in ../../../../../src/mesa/swrast/stddef.h
        not in ../../../../../src/mesa/swrast_setup/stddef.h
        not in ../../../../../src/egl/main/stddef.h
        not in ../../../../../src/egl/drivers/dri/stddef.h
        not in /usr/include/drm/stddef.h
        not in /usr/include/stddef.h
makedepend: warning:  ../../common/driverfuncs.c (reading /usr/include/gentoo-multilib/amd64/alloca.h, line 25): cannot find include file "stddef.h"
        not in /usr/lib/gcc/x86_64-pc-linux-gnu/4.1.2:/usr/lib/gcc/x86_64-pc-linux-gnu/4.1.2/32/include/stddef.h
        not in ./stddef.h
        not in ../../../../../src/mesa/drivers/dri/common/stddef.h
        not in server/stddef.h
        not in ../../../../../include/stddef.h
        not in ../../../../../include/GL/internal/stddef.h
        not in ../../../../../src/mesa/stddef.h
        not in ../../../../../src/mesa/main/stddef.h
        not in ../../../../../src/mesa/glapi/stddef.h
        not in ../../../../../src/mesa/math/stddef.h
        not in ../../../../../src/mesa/transform/stddef.h
        not in ../../../../../src/mesa/shader/stddef.h
        not in ../../../../../src/mesa/swrast/stddef.h
        not in ../../../../../src/mesa/swrast_setup/stddef.h
        not in ../../../../../src/egl/main/stddef.h
        not in ../../../../../src/egl/drivers/dri/stddef.h
        not in /usr/include/drm/stddef.h
        not in /usr/include/stddef.h
makedepend: warning:  ../../common/driverfuncs.c (reading /usr/include/gentoo-multilib/amd64/stdio.h, line 34): cannot find include file "stddef.h"
        not in /usr/lib/gcc/x86_64-pc-linux-gnu/4.1.2:/usr/lib/gcc/x86_64-pc-linux-gnu/4.1.2/32/include/stddef.h
        not in ./stddef.h
        not in ../../../../../src/mesa/drivers/dri/common/stddef.h
        not in server/stddef.h
        not in ../../../../../include/stddef.h
        not in ../../../../../include/GL/internal/stddef.h
        not in ../../../../../src/mesa/stddef.h
        not in ../../../../../src/mesa/main/stddef.h
        not in ../../../../../src/mesa/glapi/stddef.h
        not in ../../../../../src/mesa/math/stddef.h
        not in ../../../../../src/mesa/transform/stddef.h
        not in ../../../../../src/mesa/shader/stddef.h
        not in ../../../../../src/mesa/swrast/stddef.h
        not in ../../../../../src/mesa/swrast_setup/stddef.h
        not in ../../../../../src/egl/main/stddef.h
        not in ../../../../../src/egl/drivers/dri/stddef.h
        not in /usr/include/drm/stddef.h
        not in /usr/include/stddef.h
makedepend: warning:  ../../common/driverfuncs.c (reading /usr/include/gentoo-multilib/amd64/_G_config.h, line 14): cannot find include file "stddef.h"
        not in /usr/lib/gcc/x86_64-pc-linux-gnu/4.1.2:/usr/lib/gcc/x86_64-pc-linux-gnu/4.1.2/32/include/stddef.h
        not in ./stddef.h
        not in ../../../../../src/mesa/drivers/dri/common/stddef.h
        not in server/stddef.h
        not in ../../../../../include/stddef.h
        not in ../../../../../include/GL/internal/stddef.h
        not in ../../../../../src/mesa/stddef.h
        not in ../../../../../src/mesa/main/stddef.h
        not in ../../../../../src/mesa/glapi/stddef.h
        not in ../../../../../src/mesa/math/stddef.h
        not in ../../../../../src/mesa/transform/stddef.h
        not in ../../../../../src/mesa/shader/stddef.h
        not in ../../../../../src/mesa/swrast/stddef.h
        not in ../../../../../src/mesa/swrast_setup/stddef.h
        not in ../../../../../src/egl/main/stddef.h
        not in ../../../../../src/egl/drivers/dri/stddef.h
        not in /usr/include/drm/stddef.h
        not in /usr/include/stddef.h
makedepend: warning:  ../../common/driverfuncs.c (reading /usr/include/gentoo-multilib/amd64/wchar.h, line 48): cannot find include file "stddef.h"
        not in /usr/lib/gcc/x86_64-pc-linux-gnu/4.1.2:/usr/lib/gcc/x86_64-pc-linux-gnu/4.1.2/32/include/stddef.h
        not in ./stddef.h
        not in ../../../../../src/mesa/drivers/dri/common/stddef.h
        not in server/stddef.h
        not in ../../../../../include/stddef.h
        not in ../../../../../include/GL/internal/stddef.h
        not in ../../../../../src/mesa/stddef.h
        not in ../../../../../src/mesa/main/stddef.h
        not in ../../../../../src/mesa/glapi/stddef.h
        not in ../../../../../src/mesa/math/stddef.h
        not in ../../../../../src/mesa/transform/stddef.h
        not in ../../../../../src/mesa/shader/stddef.h
        not in ../../../../../src/mesa/swrast/stddef.h
        not in ../../../../../src/mesa/swrast_setup/stddef.h
        not in ../../../../../src/egl/main/stddef.h
        not in ../../../../../src/egl/drivers/dri/stddef.h
        not in /usr/include/drm/stddef.h
        not in /usr/include/stddef.h
makedepend: warning:  ../../common/driverfuncs.c (reading /usr/include/gentoo-multilib/amd64/gconv.h, line 31): cannot find include file "stddef.h"
        not in /usr/lib/gcc/x86_64-pc-linux-gnu/4.1.2:/usr/lib/gcc/x86_64-pc-linux-gnu/4.1.2/32/include/stddef.h
        not in ./stddef.h
        not in ../../../../../src/mesa/drivers/dri/common/stddef.h
        not in server/stddef.h
        not in ../../../../../include/stddef.h
        not in ../../../../../include/GL/internal/stddef.h
        not in ../../../../../src/mesa/stddef.h
        not in ../../../../../src/mesa/main/stddef.h
        not in ../../../../../src/mesa/glapi/stddef.h
        not in ../../../../../src/mesa/math/stddef.h
        not in ../../../../../src/mesa/transform/stddef.h
        not in ../../../../../src/mesa/shader/stddef.h
        not in ../../../../../src/mesa/swrast/stddef.h
        not in ../../../../../src/mesa/swrast_setup/stddef.h
        not in ../../../../../src/egl/main/stddef.h
        not in ../../../../../src/egl/drivers/dri/stddef.h
        not in /usr/include/drm/stddef.h
        not in /usr/include/stddef.h
makedepend: warning:  ../../common/driverfuncs.c (reading /usr/include/gentoo-multilib/amd64/libio.h, line 53): cannot find include file "stdarg.h"
        not in /usr/lib/gcc/x86_64-pc-linux-gnu/4.1.2:/usr/lib/gcc/x86_64-pc-linux-gnu/4.1.2/32/include/stdarg.h
        not in ./stdarg.h
        not in ../../../../../src/mesa/drivers/dri/common/stdarg.h
        not in server/stdarg.h
        not in ../../../../../include/stdarg.h
        not in ../../../../../include/GL/internal/stdarg.h
        not in ../../../../../src/mesa/stdarg.h
        not in ../../../../../src/mesa/main/stdarg.h
        not in ../../../../../src/mesa/glapi/stdarg.h
        not in ../../../../../src/mesa/math/stdarg.h
        not in ../../../../../src/mesa/transform/stdarg.h
        not in ../../../../../src/mesa/shader/stdarg.h
        not in ../../../../../src/mesa/swrast/stdarg.h
        not in ../../../../../src/mesa/swrast_setup/stdarg.h
        not in ../../../../../src/egl/main/stdarg.h
        not in ../../../../../src/egl/drivers/dri/stdarg.h
        not in /usr/include/drm/stdarg.h
        not in /usr/include/stdarg.h
makedepend: warning:  ../../common/driverfuncs.c (reading /usr/include/gentoo-multilib/amd64/string.h, line 33): cannot find include file "stddef.h"
        not in /usr/lib/gcc/x86_64-pc-linux-gnu/4.1.2:/usr/lib/gcc/x86_64-pc-linux-gnu/4.1.2/32/include/stddef.h
        not in ./stddef.h
        not in ../../../../../src/mesa/drivers/dri/common/stddef.h
        not in server/stddef.h
        not in ../../../../../include/stddef.h
        not in ../../../../../include/GL/internal/stddef.h
        not in ../../../../../src/mesa/stddef.h
        not in ../../../../../src/mesa/main/stddef.h
        not in ../../../../../src/mesa/glapi/stddef.h
        not in ../../../../../src/mesa/math/stddef.h
        not in ../../../../../src/mesa/transform/stddef.h
        not in ../../../../../src/mesa/shader/stddef.h
        not in ../../../../../src/mesa/swrast/stddef.h
        not in ../../../../../src/mesa/swrast_setup/stddef.h
        not in ../../../../../src/egl/main/stddef.h
        not in ../../../../../src/egl/drivers/dri/stddef.h
        not in /usr/include/drm/stddef.h
        not in /usr/include/stddef.h
makedepend: warning:  ../../common/driverfuncs.c (reading ../../../../../src/mesa/main/glheader.h, line 68): cannot find include file "float.h"
        not in /usr/lib/gcc/x86_64-pc-linux-gnu/4.1.2:/usr/lib/gcc/x86_64-pc-linux-gnu/4.1.2/32/include/float.h
        not in ./float.h
        not in ../../../../../src/mesa/drivers/dri/common/float.h
        not in server/float.h
        not in ../../../../../include/float.h
        not in ../../../../../include/GL/internal/float.h
        not in ../../../../../src/mesa/float.h
        not in ../../../../../src/mesa/main/float.h
        not in ../../../../../src/mesa/glapi/float.h
        not in ../../../../../src/mesa/math/float.h
        not in ../../../../../src/mesa/transform/float.h
        not in ../../../../../src/mesa/shader/float.h
        not in ../../../../../src/mesa/swrast/float.h
        not in ../../../../../src/mesa/swrast_setup/float.h
        not in ../../../../../src/egl/main/float.h
        not in ../../../../../src/egl/drivers/dri/float.h
        not in /usr/include/drm/float.h
        not in /usr/include/float.h
makedepend: warning:  ../../common/driverfuncs.c (reading ../../../../../src/mesa/main/glheader.h, line 69): cannot find include file "stdarg.h"
        not in /usr/lib/gcc/x86_64-pc-linux-gnu/4.1.2:/usr/lib/gcc/x86_64-pc-linux-gnu/4.1.2/32/include/stdarg.h
        not in ./stdarg.h
        not in ../../../../../src/mesa/drivers/dri/common/stdarg.h
        not in server/stdarg.h
        not in ../../../../../include/stdarg.h
        not in ../../../../../include/GL/internal/stdarg.h
        not in ../../../../../src/mesa/stdarg.h
        not in ../../../../../src/mesa/main/stdarg.h
        not in ../../../../../src/mesa/glapi/stdarg.h
        not in ../../../../../src/mesa/math/stdarg.h
        not in ../../../../../src/mesa/transform/stdarg.h
        not in ../../../../../src/mesa/shader/stdarg.h
        not in ../../../../../src/mesa/swrast/stdarg.h
        not in ../../../../../src/mesa/swrast_setup/stdarg.h
        not in ../../../../../src/egl/main/stdarg.h
        not in ../../../../../src/egl/drivers/dri/stdarg.h
        not in /usr/include/drm/stdarg.h
        not in /usr/include/stdarg.h
makedepend: warning:  ../../common/driverfuncs.c (reading /usr/include/gentoo-multilib/amd64/inttypes.h, line 38): cannot find include file "stddef.h"
        not in /usr/lib/gcc/x86_64-pc-linux-gnu/4.1.2:/usr/lib/gcc/x86_64-pc-linux-gnu/4.1.2/32/include/stddef.h
        not in ./stddef.h
        not in ../../../../../src/mesa/drivers/dri/common/stddef.h
        not in server/stddef.h
        not in ../../../../../include/stddef.h
        not in ../../../../../include/GL/internal/stddef.h
        not in ../../../../../src/mesa/stddef.h
        not in ../../../../../src/mesa/main/stddef.h
        not in ../../../../../src/mesa/glapi/stddef.h
        not in ../../../../../src/mesa/math/stddef.h
        not in ../../../../../src/mesa/transform/stddef.h
        not in ../../../../../src/mesa/shader/stddef.h
        not in ../../../../../src/mesa/swrast/stddef.h
        not in ../../../../../src/mesa/swrast_setup/stddef.h
        not in ../../../../../src/egl/main/stddef.h
        not in ../../../../../src/egl/drivers/dri/stddef.h
        not in /usr/include/drm/stddef.h
        not in /usr/include/stddef.h
makedepend: warning:  ../../common/driverfuncs.c (reading ../../../../../include/GL/glext.h, line 3385): cannot find include file "stddef.h"
        not in /usr/lib/gcc/x86_64-pc-linux-gnu/4.1.2:/usr/lib/gcc/x86_64-pc-linux-gnu/4.1.2/32/include/stddef.h
        not in ./stddef.h
        not in ../../../../../src/mesa/drivers/dri/common/stddef.h
        not in server/stddef.h
        not in ../../../../../include/stddef.h
        not in ../../../../../include/GL/internal/stddef.h
        not in ../../../../../src/mesa/stddef.h
        not in ../../../../../src/mesa/main/stddef.h
        not in ../../../../../src/mesa/glapi/stddef.h
        not in ../../../../../src/mesa/math/stddef.h
        not in ../../../../../src/mesa/transform/stddef.h
        not in ../../../../../src/mesa/shader/stddef.h
        not in ../../../../../src/mesa/swrast/stddef.h
        not in ../../../../../src/mesa/swrast_setup/stddef.h
        not in ../../../../../src/egl/main/stddef.h
        not in ../../../../../src/egl/drivers/dri/stddef.h
        not in /usr/include/drm/stddef.h
        not in /usr/include/stddef.h
makedepend: warning:  ../common/utils.c (reading /usr/include/drm/drm.h), line 209: # warning "__SIZE_TYPE__ not defined.  Assuming sizeof(size_t) == sizeof(unsigned long)!"
makedepend: warning:  ../common/utils.c (reading /usr/include/xf86drm.h, line 39): cannot find include file "stdarg.h"
        not in /usr/lib/gcc/x86_64-pc-linux-gnu/4.1.2:/usr/lib/gcc/x86_64-pc-linux-gnu/4.1.2/32/include/stdarg.h
        not in ./stdarg.h
        not in ../../../../../src/mesa/drivers/dri/common/stdarg.h
        not in server/stdarg.h
        not in ../../../../../include/stdarg.h
        not in ../../../../../include/GL/internal/stdarg.h
        not in ../../../../../src/mesa/stdarg.h
        not in ../../../../../src/mesa/main/stdarg.h
        not in ../../../../../src/mesa/glapi/stdarg.h
        not in ../../../../../src/mesa/math/stdarg.h
        not in ../../../../../src/mesa/transform/stdarg.h
        not in ../../../../../src/mesa/shader/stdarg.h
        not in ../../../../../src/mesa/swrast/stdarg.h
        not in ../../../../../src/mesa/swrast_setup/stdarg.h
        not in ../../../../../src/egl/main/stdarg.h
        not in ../../../../../src/egl/drivers/dri/stdarg.h
        not in /usr/include/drm/stdarg.h
        not in /usr/include/stdarg.h
makedepend: warning:  ../common/utils.c (reading /usr/include/xf86mm.h, line 31): cannot find include file "stddef.h"
        not in /usr/lib/gcc/x86_64-pc-linux-gnu/4.1.2:/usr/lib/gcc/x86_64-pc-linux-gnu/4.1.2/32/include/stddef.h
        not in ./stddef.h
        not in ../../../../../src/mesa/drivers/dri/common/stddef.h
        not in server/stddef.h
        not in ../../../../../include/stddef.h
        not in ../../../../../include/GL/internal/stddef.h
        not in ../../../../../src/mesa/stddef.h
        not in ../../../../../src/mesa/main/stddef.h
        not in ../../../../../src/mesa/glapi/stddef.h
        not in ../../../../../src/mesa/math/stddef.h
        not in ../../../../../src/mesa/transform/stddef.h
        not in ../../../../../src/mesa/shader/stddef.h
        not in ../../../../../src/mesa/swrast/stddef.h
        not in ../../../../../src/mesa/swrast_setup/stddef.h
        not in ../../../../../src/egl/main/stddef.h
        not in ../../../../../src/egl/drivers/dri/stddef.h
        not in /usr/include/drm/stddef.h
        not in /usr/include/stddef.h
makedepend: warning:  ../common/vblank.c (reading /usr/include/gentoo-multilib/amd64/unistd.h, line 197): cannot find include file "stddef.h"
        not in /usr/lib/gcc/x86_64-pc-linux-gnu/4.1.2:/usr/lib/gcc/x86_64-pc-linux-gnu/4.1.2/32/include/stddef.h
        not in ./stddef.h
        not in ../../../../../src/mesa/drivers/dri/common/stddef.h
        not in server/stddef.h
        not in ../../../../../include/stddef.h
        not in ../../../../../include/GL/internal/stddef.h
        not in ../../../../../src/mesa/stddef.h
        not in ../../../../../src/mesa/main/stddef.h
        not in ../../../../../src/mesa/glapi/stddef.h
        not in ../../../../../src/mesa/math/stddef.h
        not in ../../../../../src/mesa/transform/stddef.h
        not in ../../../../../src/mesa/shader/stddef.h
        not in ../../../../../src/mesa/swrast/stddef.h
        not in ../../../../../src/mesa/swrast_setup/stddef.h
        not in ../../../../../src/egl/main/stddef.h
        not in ../../../../../src/egl/drivers/dri/stddef.h
        not in /usr/include/drm/stddef.h
        not in /usr/include/stddef.h
makedepend: warning:  ../common/dri_util.c, line 20: cannot find include file "stdarg.h"
        not in /usr/lib/gcc/x86_64-pc-linux-gnu/4.1.2:/usr/lib/gcc/x86_64-pc-linux-gnu/4.1.2/32/include/stdarg.h
        not in ./stdarg.h
        not in ../../../../../src/mesa/drivers/dri/common/stdarg.h
        not in server/stdarg.h
        not in ../../../../../include/stdarg.h
        not in ../../../../../include/GL/internal/stdarg.h
        not in ../../../../../src/mesa/stdarg.h
        not in ../../../../../src/mesa/main/stdarg.h
        not in ../../../../../src/mesa/glapi/stdarg.h
        not in ../../../../../src/mesa/math/stdarg.h
        not in ../../../../../src/mesa/transform/stdarg.h
        not in ../../../../../src/mesa/shader/stdarg.h
        not in ../../../../../src/mesa/swrast/stdarg.h
        not in ../../../../../src/mesa/swrast_setup/stdarg.h
        not in ../../../../../src/egl/main/stdarg.h
        not in ../../../../../src/egl/drivers/dri/stdarg.h
        not in /usr/include/drm/stdarg.h
        not in /usr/include/stdarg.h
makedepend: warning:  ../common/dri_util.c (reading /usr/include/gentoo-multilib/amd64/sys/mman.h, line 26): cannot find include file "stddef.h"
        not in /usr/lib/gcc/x86_64-pc-linux-gnu/4.1.2:/usr/lib/gcc/x86_64-pc-linux-gnu/4.1.2/32/include/stddef.h
        not in ./stddef.h
        not in ../../../../../src/mesa/drivers/dri/common/stddef.h
        not in server/stddef.h
        not in ../../../../../include/stddef.h
        not in ../../../../../include/GL/internal/stddef.h
        not in ../../../../../src/mesa/stddef.h
        not in ../../../../../src/mesa/main/stddef.h
        not in ../../../../../src/mesa/glapi/stddef.h
        not in ../../../../../src/mesa/math/stddef.h
        not in ../../../../../src/mesa/transform/stddef.h
        not in ../../../../../src/mesa/shader/stddef.h
        not in ../../../../../src/mesa/swrast/stddef.h
        not in ../../../../../src/mesa/swrast_setup/stddef.h
        not in ../../../../../src/egl/main/stddef.h
        not in ../../../../../src/egl/drivers/dri/stddef.h
        not in /usr/include/drm/stddef.h
        not in /usr/include/stddef.h
makedepend: warning:  i915_program.c (reading /usr/include/gentoo-multilib/amd64/strings.h, line 29): cannot find include file "stddef.h"
        not in /usr/lib/gcc/x86_64-pc-linux-gnu/4.1.2:/usr/lib/gcc/x86_64-pc-linux-gnu/4.1.2/32/include/stddef.h
        not in ./stddef.h
        not in ../../../../../src/mesa/drivers/dri/common/stddef.h
        not in server/stddef.h
        not in ../../../../../include/stddef.h
        not in ../../../../../include/GL/internal/stddef.h
        not in ../../../../../src/mesa/stddef.h
        not in ../../../../../src/mesa/main/stddef.h
        not in ../../../../../src/mesa/glapi/stddef.h
        not in ../../../../../src/mesa/math/stddef.h
        not in ../../../../../src/mesa/transform/stddef.h
        not in ../../../../../src/mesa/shader/stddef.h
        not in ../../../../../src/mesa/swrast/stddef.h
        not in ../../../../../src/mesa/swrast_setup/stddef.h
        not in ../../../../../src/egl/main/stddef.h
        not in ../../../../../src/egl/drivers/dri/stddef.h
        not in /usr/include/drm/stddef.h
        not in /usr/include/stddef.h
mklib: Making Linux shared library:  i915_dri.so
../Makefile.template:107: depend: Aucun fichier ou répertoire de ce type
makedepend: warning:  ../../common/driverfuncs.c (reading /usr/include/gentoo-multilib/amd64/bits/types.h, line 31): cannot find include file "stddef.h"
        not in /usr/lib/gcc/x86_64-pc-linux-gnu/4.1.2:/usr/lib/gcc/x86_64-pc-linux-gnu/4.1.2/32/include/stddef.h
        not in ../intel/stddef.h
        not in ./stddef.h
        not in ../../../../../src/mesa/drivers/dri/common/stddef.h
        not in server/stddef.h
        not in ../../../../../include/stddef.h
        not in ../../../../../include/GL/internal/stddef.h
        not in ../../../../../src/mesa/stddef.h
        not in ../../../../../src/mesa/main/stddef.h
        not in ../../../../../src/mesa/glapi/stddef.h
        not in ../../../../../src/mesa/math/stddef.h
        not in ../../../../../src/mesa/transform/stddef.h
        not in ../../../../../src/mesa/shader/stddef.h
        not in ../../../../../src/mesa/swrast/stddef.h
        not in ../../../../../src/mesa/swrast_setup/stddef.h
        not in ../../../../../src/egl/main/stddef.h
        not in ../../../../../src/egl/drivers/dri/stddef.h
        not in /usr/include/drm/stddef.h
        not in /usr/include/stddef.h
makedepend: warning:  ../../common/driverfuncs.c (reading /usr/include/gentoo-multilib/amd64/limits.h, line 125): cannot find include file "limits.h"
makedepend: warning:  ../../common/driverfuncs.c (reading /usr/include/gentoo-multilib/amd64/stdlib.h, line 33): cannot find include file "stddef.h"
        not in /usr/lib/gcc/x86_64-pc-linux-gnu/4.1.2:/usr/lib/gcc/x86_64-pc-linux-gnu/4.1.2/32/include/stddef.h
        not in ../intel/stddef.h
        not in ./stddef.h
        not in ../../../../../src/mesa/drivers/dri/common/stddef.h
        not in server/stddef.h
        not in ../../../../../include/stddef.h
        not in ../../../../../include/GL/internal/stddef.h
        not in ../../../../../src/mesa/stddef.h
        not in ../../../../../src/mesa/main/stddef.h
        not in ../../../../../src/mesa/glapi/stddef.h
        not in ../../../../../src/mesa/math/stddef.h
        not in ../../../../../src/mesa/transform/stddef.h
        not in ../../../../../src/mesa/shader/stddef.h
        not in ../../../../../src/mesa/swrast/stddef.h
        not in ../../../../../src/mesa/swrast_setup/stddef.h
        not in ../../../../../src/egl/main/stddef.h
        not in ../../../../../src/egl/drivers/dri/stddef.h
        not in /usr/include/drm/stddef.h
        not in /usr/include/stddef.h
makedepend: warning:  ../../common/driverfuncs.c (reading /usr/include/gentoo-multilib/amd64/sys/types.h, line 147): cannot find include file "stddef.h"
        not in /usr/lib/gcc/x86_64-pc-linux-gnu/4.1.2:/usr/lib/gcc/x86_64-pc-linux-gnu/4.1.2/32/include/stddef.h
        not in ../intel/stddef.h
        not in ./stddef.h
        not in ../../../../../src/mesa/drivers/dri/common/stddef.h
        not in server/stddef.h
        not in ../../../../../include/stddef.h
        not in ../../../../../include/GL/internal/stddef.h
        not in ../../../../../src/mesa/stddef.h
        not in ../../../../../src/mesa/main/stddef.h
        not in ../../../../../src/mesa/glapi/stddef.h
        not in ../../../../../src/mesa/math/stddef.h
        not in ../../../../../src/mesa/transform/stddef.h
        not in ../../../../../src/mesa/shader/stddef.h
        not in ../../../../../src/mesa/swrast/stddef.h
        not in ../../../../../src/mesa/swrast_setup/stddef.h
        not in ../../../../../src/egl/main/stddef.h
        not in ../../../../../src/egl/drivers/dri/stddef.h
        not in /usr/include/drm/stddef.h
        not in /usr/include/stddef.h
makedepend: warning:  ../../common/driverfuncs.c (reading /usr/include/gentoo-multilib/amd64/alloca.h, line 25): cannot find include file "stddef.h"
        not in /usr/lib/gcc/x86_64-pc-linux-gnu/4.1.2:/usr/lib/gcc/x86_64-pc-linux-gnu/4.1.2/32/include/stddef.h
        not in ../intel/stddef.h
        not in ./stddef.h
        not in ../../../../../src/mesa/drivers/dri/common/stddef.h
        not in server/stddef.h
        not in ../../../../../include/stddef.h
        not in ../../../../../include/GL/internal/stddef.h
        not in ../../../../../src/mesa/stddef.h
        not in ../../../../../src/mesa/main/stddef.h
        not in ../../../../../src/mesa/glapi/stddef.h
        not in ../../../../../src/mesa/math/stddef.h
        not in ../../../../../src/mesa/transform/stddef.h
        not in ../../../../../src/mesa/shader/stddef.h
        not in ../../../../../src/mesa/swrast/stddef.h
        not in ../../../../../src/mesa/swrast_setup/stddef.h
        not in ../../../../../src/egl/main/stddef.h
        not in ../../../../../src/egl/drivers/dri/stddef.h
        not in /usr/include/drm/stddef.h
        not in /usr/include/stddef.h
makedepend: warning:  ../../common/driverfuncs.c (reading /usr/include/gentoo-multilib/amd64/stdio.h, line 34): cannot find include file "stddef.h"
        not in /usr/lib/gcc/x86_64-pc-linux-gnu/4.1.2:/usr/lib/gcc/x86_64-pc-linux-gnu/4.1.2/32/include/stddef.h
        not in ../intel/stddef.h
        not in ./stddef.h
        not in ../../../../../src/mesa/drivers/dri/common/stddef.h
        not in server/stddef.h
        not in ../../../../../include/stddef.h
        not in ../../../../../include/GL/internal/stddef.h
        not in ../../../../../src/mesa/stddef.h
        not in ../../../../../src/mesa/main/stddef.h
        not in ../../../../../src/mesa/glapi/stddef.h
        not in ../../../../../src/mesa/math/stddef.h
        not in ../../../../../src/mesa/transform/stddef.h
        not in ../../../../../src/mesa/shader/stddef.h
        not in ../../../../../src/mesa/swrast/stddef.h
        not in ../../../../../src/mesa/swrast_setup/stddef.h
        not in ../../../../../src/egl/main/stddef.h
        not in ../../../../../src/egl/drivers/dri/stddef.h
        not in /usr/include/drm/stddef.h
        not in /usr/include/stddef.h
makedepend: warning:  ../../common/driverfuncs.c (reading /usr/include/gentoo-multilib/amd64/_G_config.h, line 14): cannot find include file "stddef.h"
        not in /usr/lib/gcc/x86_64-pc-linux-gnu/4.1.2:/usr/lib/gcc/x86_64-pc-linux-gnu/4.1.2/32/include/stddef.h
        not in ../intel/stddef.h
        not in ./stddef.h
        not in ../../../../../src/mesa/drivers/dri/common/stddef.h
        not in server/stddef.h
        not in ../../../../../include/stddef.h
        not in ../../../../../include/GL/internal/stddef.h
        not in ../../../../../src/mesa/stddef.h
        not in ../../../../../src/mesa/main/stddef.h
        not in ../../../../../src/mesa/glapi/stddef.h
        not in ../../../../../src/mesa/math/stddef.h
        not in ../../../../../src/mesa/transform/stddef.h
        not in ../../../../../src/mesa/shader/stddef.h
        not in ../../../../../src/mesa/swrast/stddef.h
        not in ../../../../../src/mesa/swrast_setup/stddef.h
        not in ../../../../../src/egl/main/stddef.h
        not in ../../../../../src/egl/drivers/dri/stddef.h
        not in /usr/include/drm/stddef.h
        not in /usr/include/stddef.h
makedepend: warning:  ../../common/driverfuncs.c (reading /usr/include/gentoo-multilib/amd64/wchar.h, line 48): cannot find include file "stddef.h"
        not in /usr/lib/gcc/x86_64-pc-linux-gnu/4.1.2:/usr/lib/gcc/x86_64-pc-linux-gnu/4.1.2/32/include/stddef.h
        not in ../intel/stddef.h
        not in ./stddef.h
        not in ../../../../../src/mesa/drivers/dri/common/stddef.h
        not in server/stddef.h
        not in ../../../../../include/stddef.h
        not in ../../../../../include/GL/internal/stddef.h
        not in ../../../../../src/mesa/stddef.h
        not in ../../../../../src/mesa/main/stddef.h
        not in ../../../../../src/mesa/glapi/stddef.h
        not in ../../../../../src/mesa/math/stddef.h
        not in ../../../../../src/mesa/transform/stddef.h
        not in ../../../../../src/mesa/shader/stddef.h
        not in ../../../../../src/mesa/swrast/stddef.h
        not in ../../../../../src/mesa/swrast_setup/stddef.h
        not in ../../../../../src/egl/main/stddef.h
        not in ../../../../../src/egl/drivers/dri/stddef.h
        not in /usr/include/drm/stddef.h
        not in /usr/include/stddef.h
makedepend: warning:  ../../common/driverfuncs.c (reading /usr/include/gentoo-multilib/amd64/gconv.h, line 31): cannot find include file "stddef.h"
        not in /usr/lib/gcc/x86_64-pc-linux-gnu/4.1.2:/usr/lib/gcc/x86_64-pc-linux-gnu/4.1.2/32/include/stddef.h
        not in ../intel/stddef.h
        not in ./stddef.h
        not in ../../../../../src/mesa/drivers/dri/common/stddef.h
        not in server/stddef.h
        not in ../../../../../include/stddef.h
        not in ../../../../../include/GL/internal/stddef.h
        not in ../../../../../src/mesa/stddef.h
        not in ../../../../../src/mesa/main/stddef.h
        not in ../../../../../src/mesa/glapi/stddef.h
        not in ../../../../../src/mesa/math/stddef.h
        not in ../../../../../src/mesa/transform/stddef.h
        not in ../../../../../src/mesa/shader/stddef.h
        not in ../../../../../src/mesa/swrast/stddef.h
        not in ../../../../../src/mesa/swrast_setup/stddef.h
        not in ../../../../../src/egl/main/stddef.h
        not in ../../../../../src/egl/drivers/dri/stddef.h
        not in /usr/include/drm/stddef.h
        not in /usr/include/stddef.h
makedepend: warning:  ../../common/driverfuncs.c (reading /usr/include/gentoo-multilib/amd64/libio.h, line 53): cannot find include file "stdarg.h"
        not in /usr/lib/gcc/x86_64-pc-linux-gnu/4.1.2:/usr/lib/gcc/x86_64-pc-linux-gnu/4.1.2/32/include/stdarg.h
        not in ../intel/stdarg.h
        not in ./stdarg.h
        not in ../../../../../src/mesa/drivers/dri/common/stdarg.h
        not in server/stdarg.h
        not in ../../../../../include/stdarg.h
        not in ../../../../../include/GL/internal/stdarg.h
        not in ../../../../../src/mesa/stdarg.h
        not in ../../../../../src/mesa/main/stdarg.h
        not in ../../../../../src/mesa/glapi/stdarg.h
        not in ../../../../../src/mesa/math/stdarg.h
        not in ../../../../../src/mesa/transform/stdarg.h
        not in ../../../../../src/mesa/shader/stdarg.h
        not in ../../../../../src/mesa/swrast/stdarg.h
        not in ../../../../../src/mesa/swrast_setup/stdarg.h
        not in ../../../../../src/egl/main/stdarg.h
        not in ../../../../../src/egl/drivers/dri/stdarg.h
        not in /usr/include/drm/stdarg.h
        not in /usr/include/stdarg.h
makedepend: warning:  ../../common/driverfuncs.c (reading /usr/include/gentoo-multilib/amd64/string.h, line 33): cannot find include file "stddef.h"
        not in /usr/lib/gcc/x86_64-pc-linux-gnu/4.1.2:/usr/lib/gcc/x86_64-pc-linux-gnu/4.1.2/32/include/stddef.h
        not in ../intel/stddef.h
        not in ./stddef.h
        not in ../../../../../src/mesa/drivers/dri/common/stddef.h
        not in server/stddef.h
        not in ../../../../../include/stddef.h
        not in ../../../../../include/GL/internal/stddef.h
        not in ../../../../../src/mesa/stddef.h
        not in ../../../../../src/mesa/main/stddef.h
        not in ../../../../../src/mesa/glapi/stddef.h
        not in ../../../../../src/mesa/math/stddef.h
        not in ../../../../../src/mesa/transform/stddef.h
        not in ../../../../../src/mesa/shader/stddef.h
        not in ../../../../../src/mesa/swrast/stddef.h
        not in ../../../../../src/mesa/swrast_setup/stddef.h
        not in ../../../../../src/egl/main/stddef.h
        not in ../../../../../src/egl/drivers/dri/stddef.h
        not in /usr/include/drm/stddef.h
        not in /usr/include/stddef.h
makedepend: warning:  ../../common/driverfuncs.c (reading ../../../../../src/mesa/main/glheader.h, line 68): cannot find include file "float.h"
        not in /usr/lib/gcc/x86_64-pc-linux-gnu/4.1.2:/usr/lib/gcc/x86_64-pc-linux-gnu/4.1.2/32/include/float.h
        not in ../intel/float.h
        not in ./float.h
        not in ../../../../../src/mesa/drivers/dri/common/float.h
        not in server/float.h
        not in ../../../../../include/float.h
        not in ../../../../../include/GL/internal/float.h
        not in ../../../../../src/mesa/float.h
        not in ../../../../../src/mesa/main/float.h
        not in ../../../../../src/mesa/glapi/float.h
        not in ../../../../../src/mesa/math/float.h
        not in ../../../../../src/mesa/transform/float.h
        not in ../../../../../src/mesa/shader/float.h
        not in ../../../../../src/mesa/swrast/float.h
        not in ../../../../../src/mesa/swrast_setup/float.h
        not in ../../../../../src/egl/main/float.h
        not in ../../../../../src/egl/drivers/dri/float.h
        not in /usr/include/drm/float.h
        not in /usr/include/float.h
makedepend: warning:  ../../common/driverfuncs.c (reading ../../../../../src/mesa/main/glheader.h, line 69): cannot find include file "stdarg.h"
        not in /usr/lib/gcc/x86_64-pc-linux-gnu/4.1.2:/usr/lib/gcc/x86_64-pc-linux-gnu/4.1.2/32/include/stdarg.h
        not in ../intel/stdarg.h
        not in ./stdarg.h
        not in ../../../../../src/mesa/drivers/dri/common/stdarg.h
        not in server/stdarg.h
        not in ../../../../../include/stdarg.h
        not in ../../../../../include/GL/internal/stdarg.h
        not in ../../../../../src/mesa/stdarg.h
        not in ../../../../../src/mesa/main/stdarg.h
        not in ../../../../../src/mesa/glapi/stdarg.h
        not in ../../../../../src/mesa/math/stdarg.h
        not in ../../../../../src/mesa/transform/stdarg.h
        not in ../../../../../src/mesa/shader/stdarg.h
        not in ../../../../../src/mesa/swrast/stdarg.h
        not in ../../../../../src/mesa/swrast_setup/stdarg.h
        not in ../../../../../src/egl/main/stdarg.h
        not in ../../../../../src/egl/drivers/dri/stdarg.h
        not in /usr/include/drm/stdarg.h
        not in /usr/include/stdarg.h
makedepend: warning:  ../../common/driverfuncs.c (reading /usr/include/gentoo-multilib/amd64/inttypes.h, line 38): cannot find include file "stddef.h"
        not in /usr/lib/gcc/x86_64-pc-linux-gnu/4.1.2:/usr/lib/gcc/x86_64-pc-linux-gnu/4.1.2/32/include/stddef.h
        not in ../intel/stddef.h
        not in ./stddef.h
        not in ../../../../../src/mesa/drivers/dri/common/stddef.h
        not in server/stddef.h
        not in ../../../../../include/stddef.h
        not in ../../../../../include/GL/internal/stddef.h
        not in ../../../../../src/mesa/stddef.h
        not in ../../../../../src/mesa/main/stddef.h
        not in ../../../../../src/mesa/glapi/stddef.h
        not in ../../../../../src/mesa/math/stddef.h
        not in ../../../../../src/mesa/transform/stddef.h
        not in ../../../../../src/mesa/shader/stddef.h
        not in ../../../../../src/mesa/swrast/stddef.h
        not in ../../../../../src/mesa/swrast_setup/stddef.h
        not in ../../../../../src/egl/main/stddef.h
        not in ../../../../../src/egl/drivers/dri/stddef.h
        not in /usr/include/drm/stddef.h
        not in /usr/include/stddef.h
makedepend: warning:  ../../common/driverfuncs.c (reading ../../../../../include/GL/glext.h, line 3385): cannot find include file "stddef.h"
        not in /usr/lib/gcc/x86_64-pc-linux-gnu/4.1.2:/usr/lib/gcc/x86_64-pc-linux-gnu/4.1.2/32/include/stddef.h
        not in ../intel/stddef.h
        not in ./stddef.h
        not in ../../../../../src/mesa/drivers/dri/common/stddef.h
        not in server/stddef.h
        not in ../../../../../include/stddef.h
        not in ../../../../../include/GL/internal/stddef.h
        not in ../../../../../src/mesa/stddef.h
        not in ../../../../../src/mesa/main/stddef.h
        not in ../../../../../src/mesa/glapi/stddef.h
        not in ../../../../../src/mesa/math/stddef.h
        not in ../../../../../src/mesa/transform/stddef.h
        not in ../../../../../src/mesa/shader/stddef.h
        not in ../../../../../src/mesa/swrast/stddef.h
        not in ../../../../../src/mesa/swrast_setup/stddef.h
        not in ../../../../../src/egl/main/stddef.h
        not in ../../../../../src/egl/drivers/dri/stddef.h
        not in /usr/include/drm/stddef.h
        not in /usr/include/stddef.h
makedepend: warning:  ../common/utils.c (reading /usr/include/drm/drm.h), line 209: # warning "__SIZE_TYPE__ not defined.  Assuming sizeof(size_t) == sizeof(unsigned long)!"
makedepend: warning:  ../common/utils.c (reading /usr/include/xf86drm.h, line 39): cannot find include file "stdarg.h"
        not in /usr/lib/gcc/x86_64-pc-linux-gnu/4.1.2:/usr/lib/gcc/x86_64-pc-linux-gnu/4.1.2/32/include/stdarg.h
        not in ../intel/stdarg.h
        not in ./stdarg.h
        not in ../../../../../src/mesa/drivers/dri/common/stdarg.h
        not in server/stdarg.h
        not in ../../../../../include/stdarg.h
        not in ../../../../../include/GL/internal/stdarg.h
        not in ../../../../../src/mesa/stdarg.h
        not in ../../../../../src/mesa/main/stdarg.h
        not in ../../../../../src/mesa/glapi/stdarg.h
        not in ../../../../../src/mesa/math/stdarg.h
        not in ../../../../../src/mesa/transform/stdarg.h
        not in ../../../../../src/mesa/shader/stdarg.h
        not in ../../../../../src/mesa/swrast/stdarg.h
        not in ../../../../../src/mesa/swrast_setup/stdarg.h
        not in ../../../../../src/egl/main/stdarg.h
        not in ../../../../../src/egl/drivers/dri/stdarg.h
        not in /usr/include/drm/stdarg.h
        not in /usr/include/stdarg.h
makedepend: warning:  ../common/utils.c (reading /usr/include/xf86mm.h, line 31): cannot find include file "stddef.h"
        not in /usr/lib/gcc/x86_64-pc-linux-gnu/4.1.2:/usr/lib/gcc/x86_64-pc-linux-gnu/4.1.2/32/include/stddef.h
        not in ../intel/stddef.h
        not in ./stddef.h
        not in ../../../../../src/mesa/drivers/dri/common/stddef.h
        not in server/stddef.h
        not in ../../../../../include/stddef.h
        not in ../../../../../include/GL/internal/stddef.h
        not in ../../../../../src/mesa/stddef.h
        not in ../../../../../src/mesa/main/stddef.h
        not in ../../../../../src/mesa/glapi/stddef.h
        not in ../../../../../src/mesa/math/stddef.h
        not in ../../../../../src/mesa/transform/stddef.h
        not in ../../../../../src/mesa/shader/stddef.h
        not in ../../../../../src/mesa/swrast/stddef.h
        not in ../../../../../src/mesa/swrast_setup/stddef.h
        not in ../../../../../src/egl/main/stddef.h
        not in ../../../../../src/egl/drivers/dri/stddef.h
        not in /usr/include/drm/stddef.h
        not in /usr/include/stddef.h
makedepend: warning:  ../common/vblank.c (reading /usr/include/gentoo-multilib/amd64/unistd.h, line 197): cannot find include file "stddef.h"
        not in /usr/lib/gcc/x86_64-pc-linux-gnu/4.1.2:/usr/lib/gcc/x86_64-pc-linux-gnu/4.1.2/32/include/stddef.h
        not in ../intel/stddef.h
        not in ./stddef.h
        not in ../../../../../src/mesa/drivers/dri/common/stddef.h
        not in server/stddef.h
        not in ../../../../../include/stddef.h
        not in ../../../../../include/GL/internal/stddef.h
        not in ../../../../../src/mesa/stddef.h
        not in ../../../../../src/mesa/main/stddef.h
        not in ../../../../../src/mesa/glapi/stddef.h
        not in ../../../../../src/mesa/math/stddef.h
        not in ../../../../../src/mesa/transform/stddef.h
        not in ../../../../../src/mesa/shader/stddef.h
        not in ../../../../../src/mesa/swrast/stddef.h
        not in ../../../../../src/mesa/swrast_setup/stddef.h
        not in ../../../../../src/egl/main/stddef.h
        not in ../../../../../src/egl/drivers/dri/stddef.h
        not in /usr/include/drm/stddef.h
        not in /usr/include/stddef.h
makedepend: warning:  ../common/dri_util.c, line 20: cannot find include file "stdarg.h"
        not in /usr/lib/gcc/x86_64-pc-linux-gnu/4.1.2:/usr/lib/gcc/x86_64-pc-linux-gnu/4.1.2/32/include/stdarg.h
        not in ../intel/stdarg.h
        not in ./stdarg.h
        not in ../../../../../src/mesa/drivers/dri/common/stdarg.h
        not in server/stdarg.h
        not in ../../../../../include/stdarg.h
        not in ../../../../../include/GL/internal/stdarg.h
        not in ../../../../../src/mesa/stdarg.h
        not in ../../../../../src/mesa/main/stdarg.h
        not in ../../../../../src/mesa/glapi/stdarg.h
        not in ../../../../../src/mesa/math/stdarg.h
        not in ../../../../../src/mesa/transform/stdarg.h
        not in ../../../../../src/mesa/shader/stdarg.h
        not in ../../../../../src/mesa/swrast/stdarg.h
        not in ../../../../../src/mesa/swrast_setup/stdarg.h
        not in ../../../../../src/egl/main/stdarg.h
        not in ../../../../../src/egl/drivers/dri/stdarg.h
        not in /usr/include/drm/stdarg.h
        not in /usr/include/stdarg.h
makedepend: warning:  ../common/dri_util.c (reading /usr/include/gentoo-multilib/amd64/sys/mman.h, line 26): cannot find include file "stddef.h"
        not in /usr/lib/gcc/x86_64-pc-linux-gnu/4.1.2:/usr/lib/gcc/x86_64-pc-linux-gnu/4.1.2/32/include/stddef.h
        not in ../intel/stddef.h
        not in ./stddef.h
        not in ../../../../../src/mesa/drivers/dri/common/stddef.h
        not in server/stddef.h
        not in ../../../../../include/stddef.h
        not in ../../../../../include/GL/internal/stddef.h
        not in ../../../../../src/mesa/stddef.h
        not in ../../../../../src/mesa/main/stddef.h
        not in ../../../../../src/mesa/glapi/stddef.h
        not in ../../../../../src/mesa/math/stddef.h
        not in ../../../../../src/mesa/transform/stddef.h
        not in ../../../../../src/mesa/shader/stddef.h
        not in ../../../../../src/mesa/swrast/stddef.h
        not in ../../../../../src/mesa/swrast_setup/stddef.h
        not in ../../../../../src/egl/main/stddef.h
        not in ../../../../../src/egl/drivers/dri/stddef.h
        not in /usr/include/drm/stddef.h
        not in /usr/include/stddef.h
makedepend: warning:  i915_program.c (reading /usr/include/gentoo-multilib/amd64/strings.h, line 29): cannot find include file "stddef.h"
        not in /usr/lib/gcc/x86_64-pc-linux-gnu/4.1.2:/usr/lib/gcc/x86_64-pc-linux-gnu/4.1.2/32/include/stddef.h
        not in ../intel/stddef.h
        not in ./stddef.h
        not in ../../../../../src/mesa/drivers/dri/common/stddef.h
        not in server/stddef.h
        not in ../../../../../include/stddef.h
        not in ../../../../../include/GL/internal/stddef.h
        not in ../../../../../src/mesa/stddef.h
        not in ../../../../../src/mesa/main/stddef.h
        not in ../../../../../src/mesa/glapi/stddef.h
        not in ../../../../../src/mesa/math/stddef.h
        not in ../../../../../src/mesa/transform/stddef.h
        not in ../../../../../src/mesa/shader/stddef.h
        not in ../../../../../src/mesa/swrast/stddef.h
        not in ../../../../../src/mesa/swrast_setup/stddef.h
        not in ../../../../../src/egl/main/stddef.h
        not in ../../../../../src/egl/drivers/dri/stddef.h
        not in /usr/include/drm/stddef.h
        not in /usr/include/stddef.h
In file included from ../common/dri_bufmgr.c:37:
../common/dri_bufmgr.h:83: erreur: expected declaration specifiers or ‘...’ before ‘drmBOList’
../common/dri_bufmgr.h:84: erreur: expected ‘)’ before ‘*’ token
../common/dri_bufmgr.h:85: erreur: expected ‘)’ before ‘*’ token
../common/dri_bufmgr.h:87: erreur: expected declaration specifiers or ‘...’ before ‘drmBOList’
../common/dri_bufmgr.c: In function ‘driFenceBuffers’:
../common/dri_bufmgr.c:102: attention : passing argument 3 of ‘drmFenceBuffers’ makes integer from pointer without a cast
../common/dri_bufmgr.c:102: erreur: too few arguments to function ‘drmFenceBuffers’
../common/dri_bufmgr.c: Hors de toute fonction :
../common/dri_bufmgr.c:437: erreur: expected declaration specifiers or ‘...’ before ‘drmBOList’
../common/dri_bufmgr.c: In function ‘driBOCreateList’:
../common/dri_bufmgr.c:440: erreur: ‘list’ undeclared (first use in this function)
../common/dri_bufmgr.c:440: erreur: (Each undeclared identifier is reported only once
../common/dri_bufmgr.c:440: erreur: for each function it appears in.)
../common/dri_bufmgr.c: Hors de toute fonction :
../common/dri_bufmgr.c:445: erreur: expected ‘)’ before ‘*’ token
../common/dri_bufmgr.c:453: erreur: expected ‘)’ before ‘*’ token
../common/dri_bufmgr.c:487: erreur: expected declaration specifiers or ‘...’ before ‘drmBOList’
../common/dri_bufmgr.c: In function ‘driBOValidateList’:
../common/dri_bufmgr.c:490: erreur: ‘list’ undeclared (first use in this function)
make[6]: *** [../common/dri_bufmgr.o] Erreur 1
make[5]: *** [subdirs] Erreur 1
make[4]: *** [linux-solo] Erreur 2
make[3]: *** [default] Erreur 2
make[2]: *** [subdirs] Erreur 1
make[1]: *** [default] Erreur 1
make: *** [linux-dri-x86-64] Erreur 2
 *
 * ERROR: media-libs/mesa-7.0.1 failed.
 * Call stack:
 *           ebuild.sh, line 1695:  Called dyn_compile
 *           ebuild.sh, line 1033:  Called qa_call 'src_compile'
 *           ebuild.sh, line   44:  Called src_compile
 *   mesa-7.0.1.ebuild, line  206:  Called die
 * The specific snippet of code:
 *      emake -j1 ${CONFIG} || die "Build failed"
 *  The die message:
 *   Build failed
 *
 * If you need support, post the topmost build error, and the call stack if relevant.
 * A complete build log is located at '/var/tmp/portage/media-libs/mesa-7.0.1/temp/build.log'.
 *

 * Messages for package media-libs/mesa-7.0.1:

 *
 * ERROR: media-libs/mesa-7.0.1 failed.
 * Call stack:
 *           ebuild.sh, line 1695:  Called dyn_compile
 *           ebuild.sh, line 1033:  Called qa_call 'src_compile'
 *           ebuild.sh, line   44:  Called src_compile
 *   mesa-7.0.1.ebuild, line  206:  Called die
 * The specific snippet of code:
 *      emake -j1 ${CONFIG} || die "Build failed"
 *  The die message:
 *   Build failed
 *
 * If you need support, post the topmost build error, and the call stack if relevant.   


My emerge --info

Code: Select all
Portage 2.1.3.16 (default-linux/amd64/2007.0, gcc-4.1.2, glibc-2.6.1-r0, 2.6.22-suspend2-r2 x86_64)
=================================================================
System uname: 2.6.22-suspend2-r2 x86_64 Intel(R) Core(TM)2 Duo CPU T7300 @ 2.00GHz
Timestamp of tree: Tue, 30 Oct 2007 09:00:01 +0000
distcc 2.18.3 x86_64-pc-linux-gnu (protocols 1 and 2) (default port 3632) [disabled]
app-shells/bash:     3.2_p17-r1
dev-java/java-config: 1.3.7, 2.1.2-r1
dev-lang/python:     2.4.4-r6, 2.5.1-r3
dev-python/pycrypto: 2.0.1-r6
sys-apps/baselayout: 1.12.10-r5
sys-apps/sandbox:    1.2.18.1-r2
sys-devel/autoconf:  2.13, 2.61-r1
sys-devel/automake:  1.4_p6, 1.5, 1.6.3, 1.7.9-r1, 1.8.5-r3, 1.9.6-r2, 1.10
sys-devel/binutils:  2.18-r1
sys-devel/gcc-config: 1.4.0-r4
sys-devel/libtool:   1.5.24
virtual/os-headers:  2.6.23
ACCEPT_KEYWORDS="amd64 ~amd64"
CBUILD="x86_64-pc-linux-gnu"
CFLAGS="-Os -march=x86-64 -pipe"
CHOST="x86_64-pc-linux-gnu"
CONFIG_PROTECT="/etc /usr/kde/3.5/env /usr/kde/3.5/share/config /usr/kde/3.5/shutdown /usr/share/config"
CONFIG_PROTECT_MASK="/etc/env.d /etc/env.d/java/ /etc/gconf /etc/revdep-rebuild /etc/terminfo /etc/texmf/web2c /etc/udev/rules.d"
CXXFLAGS="-Os -march=x86-64 -pipe"
DISTDIR="/usr/portage/distfiles"
FEATURES="distlocks metadata-transfer parallel-fetch sandbox sfperms strict unmerge-orphans userfetch"
GENTOO_MIRRORS="http://213.186.33.38/gentoo-distfiles/"
LANG="fr_FR.UTF-8"
LC_ALL="fr_FR.UTF-8"
LDFLAGS="-Wl,-O1 -Wl,--enable-new-dtags -Wl,--sort-common -s"
LINGUAS="fr"
MAKEOPTS="-s -j3"
PKGDIR="/usr/portage/packages"
PORTAGE_RSYNC_OPTS="--recursive --links --safe-links --perms --times --compress --force --whole-file --delete --delete-after --stats --timeout=180 --exclude=/distfiles --exclude=/local --exclude=/packages --filter=H_**/files/digest-*"
PORTAGE_TMPDIR="/var/tmp"
PORTDIR="/usr/portage"
PORTDIR_OVERLAY="/usr/portage/local/layman/xeffects"
SYNC="rsync://rsync.gentoo.org/gentoo-portage"
USE="7zip X a52 aac aalib accessibility acl acpi ada aiglx alsa amd64 arts artswrappersuid asterisk audiofile avahi beagle berkdb bitmap-fonts bluetooth browserplugin bzip2 cairo canvas cdda cdr cjk cli commercial cracklib crypt css cups dbox2 dbus dga divx4linux djvu dlloader dri dts dv dvb dvd dvdr dvdread dvi evo exif exscalibar fat ffmpeg firefox flac foomatic-db fortran freetype fuse gcj gdbm gif gimpprint glitz glut gnokii gnome gnutls gphoto2 gpm gsm gtk gtk2 hal hfs i810 iconv ieee1394 ipod ipv6 ipw3945 irda isdnlog jack java jfs jingle joystick jpeg jpeg2k kdgraphics kerberos kig-scripting kipi ladspa lame lcd ldap libcaca libnotify lirc live livecd lm_sensors logitech-mouse mad mbrola midi mikmod mmx mono moznocompose moznoirc moznomail mozsvg mp3 mp3rtp mpeg mudflap musepack musicbrainz nautilus ncurses nls nntp nptl nptlonly nsplugin ntfs nvidia ogg oggvorbis on-the-fly-crypt openexr opengl openmp pam pam_chroot pam_timestamp pcmcia pcre pda pdf perforce perl png povray ppds pppd pulseaudio pwdb python qemu qt qt3 qt3support qt4 rdesktop readline reflection reiser4 reiserfs remote rtsp ruby samba scanner sdl session shout skins sms sndfile soundtouch speedo speex spl sse sse2 ssl startup-notification stats stream svg symlink tcpd theora tiff timidity truetype truetype-fonts type1-fonts udev unichrome unicode usb v4l v4l2 vcd visualization vlm vorbis wifi wxwindows x264 xen xfs xine xinerama xml xml2 xorg xprint xscreensaver xv xvid xvmc zeroconf zlib" ALSA_CARDS="ali5451 als4000 atiixp atiixp-modem bt87x ca0106 cmipci emu10k1x ens1370 ens1371 es1938 es1968 fm801 hda-intel intel8x0 intel8x0m maestro3 trident usb-audio via82xx via82xx-modem ymfpci" ALSA_PCM_PLUGINS="adpcm alaw asym copy dmix dshare dsnoop empty extplug file hooks iec958 ioplug ladspa lfloat linear meter mulaw multi null plug rate route share shm softvol" ELIBC="glibc" INPUT_DEVICES="evdev keyboard mouse synaptics" KERNEL="linux" LCD_DEVICES="bayrad cfontz cfontz633 glk hd44780 lb216 lcdm001 mtxorb ncurses text" LINGUAS="fr" LIRC_DEVICES="audio audio_alsa" USERLAND="GNU" VIDEO_CARDS="vga intel i810 mach64"
Unset:  CPPFLAGS, CTARGET, EMERGE_DEFAULT_OPTS, INSTALL_MASK, PORTAGE_COMPRESS, PORTAGE_COMPRESS_FLAGS, PORTAGE_RSYNC_EXTRA_OPTS



I see that some files are missing, but i dont know wheres packages contains these files.

Anyone have an idea?

Thanks (sorry for my poor english)
mrgarrison
Baby Hen
 
Posts: 1
Joined: Wed Oct 31, 2007 16:28

Return to 3D Desktops and Window Managers

Who is online

Users browsing this forum: No registered users and 2 guests