failed to emerge esound during compiling

Anything that pertains to Portage

Moderator: Moderators

failed to emerge esound during compiling

Postby fede » Mon Aug 20, 2007 16:00

i can't upgrade esound (needed by kdelibd 3.5.7 and all kde tools).
i get this error during compiling process:

Code: Select all
jade:/usr/share/sgml/docbook/dsssl-stylesheets-1.79/html/../common/../common/dbl1bg.dsl:3:5:E: reference to entity "cyr1" for which no system identifier could be generated
jade:/usr/share/sgml/docbook/dsssl-stylesheets-1.79/html/../common/../common/dbl1bg.dsl:2:0: entity was defined here
jade:/usr/share/sgml/docbook/dsssl-stylesheets-1.79/html/../common/../common/dbl1no.dsl:2:66:W: cannot generate system identifier for public text "ISO 8879:1986//ENTITIES Added Latin 1//EN"
jade:/usr/share/sgml/docbook/dsssl-stylesheets-1.79/html/../common/../common/dbl1no.dsl:3:5:E: reference to entity "lat1" for which no system identifier could be generated
jade:/usr/share/sgml/docbook/dsssl-stylesheets-1.79/html/../common/../common/dbl1no.dsl:2:0: entity was defined here
jade:/usr/share/sgml/docbook/dsssl-stylesheets-1.79/html/../common/../common/dbl1ro.dsl:2:66:W: cannot generate system identifier for public text "ISO 8879:1986//ENTITIES Added Latin 1//EN"
jade:/usr/share/sgml/docbook/dsssl-stylesheets-1.79/html/../common/../common/dbl1ro.dsl:3:5:E: reference to entity "lat1" for which no system identifier could be generated
jade:/usr/share/sgml/docbook/dsssl-stylesheets-1.79/html/../common/../common/dbl1ro.dsl:2:0: entity was defined here
jade:/usr/share/sgml/docbook/dsssl-stylesheets-1.79/html/../common/../common/dbl1ro.dsl:4:66:W: cannot generate system identifier for public text "ISO 8879:1986//ENTITIES Added Latin 2//EN"
jade:/usr/share/sgml/docbook/dsssl-stylesheets-1.79/html/../common/../common/dbl1ro.dsl:5:5:E: reference to entity "lat2" for which no system identifier could be generated
jade:/usr/share/sgml/docbook/dsssl-stylesheets-1.79/html/../common/../common/dbl1ro.dsl:4:0: entity was defined here
jade:/usr/share/sgml/docbook/dsssl-stylesheets-1.79/html/../common/../common/dbl1ru.dsl:2:69:W: cannot generate system identifier for public text "ISO 8879:1986//ENTITIES Russian Cyrillic//EN"
jade:/usr/share/sgml/docbook/dsssl-stylesheets-1.79/html/../common/../common/dbl1ru.dsl:3:5:E: reference to entity "cyr1" for which no system identifier could be generated
jade:/usr/share/sgml/docbook/dsssl-stylesheets-1.79/html/../common/../common/dbl1ru.dsl:2:0: entity was defined here
jade:/usr/share/sgml/docbook/dsssl-stylesheets-1.79/html/../common/../common/dbl1sl.dsl:2:66:W: cannot generate system identifier for public text "ISO 8879:1986//ENTITIES Added Latin 2//EN"
jade:/usr/share/sgml/docbook/dsssl-stylesheets-1.79/html/../common/../common/dbl1sl.dsl:3:5:E: reference to entity "lat2" for which no system identifier could be generated
jade:/usr/share/sgml/docbook/dsssl-stylesheets-1.79/html/../common/../common/dbl1sl.dsl:2:0: entity was defined here
jade:/usr/share/sgml/docbook/dsssl-stylesheets-1.79/html/../common/../common/dbl1sr.dsl:2:66:W: cannot generate system identifier for public text "ISO 8879:1986//ENTITIES Added Latin 2//EN"
jade:/usr/share/sgml/docbook/dsssl-stylesheets-1.79/html/../common/../common/dbl1sr.dsl:3:5:E: reference to entity "lat2" for which no system identifier could be generated
jade:/usr/share/sgml/docbook/dsssl-stylesheets-1.79/html/../common/../common/dbl1sr.dsl:2:0: entity was defined here
make[2]: *** [html/index.html] Error 8
make[1]: *** [all-recursive] Error 1
make: *** [all] Error 2

!!! ERROR: media-sound/esound-0.2.38 failed.
Call stack:
  ebuild.sh, line 1632:   Called dyn_compile
  ebuild.sh, line 983:   Called qa_call 'src_compile'
  ebuild.sh, line 44:   Called src_compile
  esound-0.2.38.ebuild, line 52:   Called die


i tried this:
emerge -pND docbook-sgml docbook-sgml-utils docbook-sgml-dtd docbook-xml-dtd docbook-xsl-stylesheets

but without results


thank you for your help, if any ;-)

bye, ff
fede
Baby Hen
 
Posts: 18
Joined: Tue Jul 24, 2007 7:57
Location: Milano, Italy

Re: failed to emerge esound during compiling

Postby DontPanic » Mon Aug 20, 2007 17:19

Rats, I just ran across this error recently, but the search engine seems to be broken right now, and I can't find that post.

Try re-emerging docbook-dsssl-stylesheets (it looks like you left that one out in your post).

If that doesn't do it, also try re-emerging openjade.
Gigabyte GA-P35-DS3L - Intel(R) Core(TM)2 Duo CPU E6750@ 2.66GHz
nVidia GeForce 7600 GS
2 GB RAM
DontPanic
Old Dear Hen
 
Posts: 742
Joined: Mon Jul 09, 2007 20:29
Location: Mobile, AL, USA

Re: failed to emerge esound during compiling

Postby fede » Tue Aug 21, 2007 9:34

:-(

ive unmerged and re-emerged both docbook-dsssl-stylesheets and openjade....

but the error is still here..

i'm go on looking for some solutions...
ff
fede
Baby Hen
 
Posts: 18
Joined: Tue Jul 24, 2007 7:57
Location: Milano, Italy

Re: failed to emerge esound during compiling

Postby DontPanic » Tue Aug 21, 2007 14:37

I think this gentoo bug report describes your problem:

http://bugs.gentoo.org/show_bug.cgi?id=128952

There is some discussion in there of also needing to re-emerge sgml-common
Gigabyte GA-P35-DS3L - Intel(R) Core(TM)2 Duo CPU E6750@ 2.66GHz
nVidia GeForce 7600 GS
2 GB RAM
DontPanic
Old Dear Hen
 
Posts: 742
Joined: Mon Jul 09, 2007 20:29
Location: Mobile, AL, USA

Re: failed to emerge esound during compiling

Postby fede » Tue Aug 21, 2007 15:34

DontPanic wrote:I think this gentoo bug report describes your problem:[...]


thank you for your help!!!

i will check as soon as possible.

tnx, ff
fede
Baby Hen
 
Posts: 18
Joined: Tue Jul 24, 2007 7:57
Location: Milano, Italy


Return to Portage|Emerge Package Managers

Who is online

Users browsing this forum: No registered users and 2 guests