marre. j'en ai marre de vmware

Conversations générales au sujet de Sabayon Linux

Moderator: Moderators

marre. j'en ai marre de vmware

Postby support4sale » Sat Jan 27, 2007 6:03

Bon, maintenant je suis sous x86 64 et j'essais d'installer vmware-server...... encore.

J'ai essayé directement, indirectement, avec les sources, sans les sources.
Ça Marche pas !!!

J'ai toujours ce bidule qui vient me faire ch.. suer.;

/debut du bidule chiant.
'''Using 2.6.x kernel build system.
make[1]: AVERTISSEMENT: serveur de tâches n'est pas disponible: utilisation de -j1. Ajouter « + » à la règle parent du make.

WARNING: Symbol version dump /usr/src/linux-2.6.19-gentoo-r4/Module.symvers
is missing; modules will have no dependencies and modversions.'''

/Fin du bidule chiant.

J'ai pourtant suivi les instructions de là:
[url]http://www.sabayonlinux.org/forum/viewtopic.php?t=2309[/url]

Ça avait pourtant pas trop mal fini mais cette fois ça bloque ..

Alors sabayon c'est bien joli mais , après beryl, mon intéret était d'avoir un XP isolé sur demande , là, je m'énerve si quelqu'un eput me dire c'est quoi le problème...
Je sais que c'est évident mais je ne le vois pas.
(je devrais pas faire ce genre de truc passé minuit)

Merci de m'aider.

Normalement ça devrait aller dans cet ordre:
# emerge vmware-server
activer le csipt de configuration (# serie sur vmware.com)
# depmod vmnet -a
# depmod vnmon -a
# /etc/init.d/vmware start && rc-update add vmware default
on s'ajoute au groupe ''vmware'' via kuser

Mais la simple installation ne marche pas alors...

Voilà mon dump:

emerge vmware-modules
Calculating dependencies... done!

>>> Emerging (1 of 1) app-emulation/vmware-modules-1.0.0.15 to /
* VMware-server-1.0.1-29996.tar.gz MD5 ;-) ... [ ok ]
* VMware-server-1.0.1-29996.tar.gz RMD160 ;-) ... [ ok ]
* VMware-server-1.0.1-29996.tar.gz SHA1 ;-) ... [ ok ]
* VMware-server-1.0.1-29996.tar.gz SHA256 ;-) ... [ ok ]
* VMware-server-1.0.1-29996.tar.gz size ;-) ... [ ok ]
* checking ebuild checksums ;-) ... [ ok ]
* checking auxfile checksums ;-) ... [ ok ]
* checking miscfile checksums ;-) ... [ ok ]
* checking VMware-server-1.0.1-29996.tar.gz ;-) ... [ ok ]
* Determining the location of the kernel source code
* Found kernel source directory:
* /usr/src/linux
* Found sources for kernel version:
* 2.6.19-gentoo-r4
>>> Unpacking source...
>>> Unpacking VMware-server-1.0.1-29996.tar.gz to /var/tmp/portage/app-emulation/vmware-modules-1.0.0.15/work
>>> Unpacking ./vmware-server-distrib/lib/modules/source/vmmon.tar to /var/tmp/portage/app-emulation/vmware-modules-1.0.0.15/work
* Applying various patches (bugfixes/updates) ...
* 000_all_makefile-include-directory.patch ... [ ok ]
* Done with patching
* Converting vmmon-only/Makefile to use M= instead of SUBDIRS= ... [ ok ]
>>> Unpacking ./vmware-server-distrib/lib/modules/source/vmnet.tar to /var/tmp/portage/app-emulation/vmware-modules-1.0.0.15/work
* Applying various patches (bugfixes/updates) ...
* 000_all_makefile-include-directory.patch ... [ ok ]
* Done with patching
* Converting vmnet-only/Makefile to use M= instead of SUBDIRS= ... [ ok ]
* Applying 1.0.0.15-gcc4-ignore-pedantic-errors.patch ... [ ok ]
* Applying 1.0.0.15-gcc4-ignore-pedantic-errors.patch ... [ ok ]
>>> Source unpacked.
>>> Compiling source in /var/tmp/portage/app-emulation/vmware-modules-1.0.0.15/work ...
* Preparing vmmon module
Using 2.6.x kernel build system.
make[1]: AVERTISSEMENT: serveur de tâches n'est pas disponible: utilisation de -j1. Ajouter « + » à la règle parent du make.

WARNING: Symbol version dump /usr/src/linux-2.6.19-gentoo-r4/Module.symvers
is missing; modules will have no dependencies and modversions.

Building modules, stage 2.
* Preparing vmnet module
Using 2.6.x kernel build system.
make[1]: AVERTISSEMENT: serveur de tâches n'est pas disponible: utilisation de -j1. Ajouter « + » à la règle parent du make.

WARNING: Symbol version dump /usr/src/linux-2.6.19-gentoo-r4/Module.symvers
is missing; modules will have no dependencies and modversions.

/var/tmp/portage/app-emulation/vmware-modules-1.0.0.15/work/vmnet-only/userif.c: In function ‘VNetCopyDatagramToUser’:
/var/tmp/portage/app-emulation/vmware-modules-1.0.0.15/work/vmnet-only/userif.c:629: erreur: ‘CHECKSUM_HW’ undeclared (first use in this function)
/var/tmp/portage/app-emulation/vmware-modules-1.0.0.15/work/vmnet-only/userif.c:629: erreur: (Each undeclared identifier is reported only once
/var/tmp/portage/app-emulation/vmware-modules-1.0.0.15/work/vmnet-only/userif.c:629: erreur: for each function it appears in.)
make[3]: *** [/var/tmp/portage/app-emulation/vmware-modules-1.0.0.15/work/vmnet-only/userif.o] Erreur 1
make[2]: *** [_module_/var/tmp/portage/app-emulation/vmware-modules-1.0.0.15/work/vmnet-only] Erreur 2
make[1]: *** [modules] Erreur 2
make: *** [vmnet.ko] Erreur 2

!!! ERROR: app-emulation/vmware-modules-1.0.0.15 failed.
Call stack:
ebuild.sh, line 1564: Called dyn_compile
ebuild.sh, line 937: Called src_compile
ebuild.sh, line 1257: Called linux-mod_src_compile
linux-mod.eclass, line 482: Called die

!!! Unable to make auto-build VMWARE_VER=VME_S1B1 KERNEL_DIR=/usr/src/linux KBUILD_OUTPUT=/usr/src/linux.
!!! If you need support, post the topmost build error, and the call stack if relevant.

new-host linux # depmod vmmon -a
new-host linux # depmod vmnet -a
new-host linux # layman -f -a vmware
* Failed to add overlay "vmware".
* Error was: Overlay "vmware" already in the local list!
new-host linux # emerge vmware-server
Calculating dependencies... done!
>>> starting parallel fetching

>>> Emerging (1 of 3) app-emulation/vmware-modules-1.0.0.15 to /
waiting for lock on /usr/portage/distfiles/.locks/VMware-server-1.0.1-29996.tar.gz.portage_lockfile
* VMware-server-1.0.1-29996.tar.gz MD5 ;-) ... [ ok ]
* VMware-server-1.0.1-29996.tar.gz RMD160 ;-) ... [ ok ]
* VMware-server-1.0.1-29996.tar.gz SHA1 ;-) ... [ ok ]
* VMware-server-1.0.1-29996.tar.gz SHA256 ;-) ... [ ok ]
* VMware-server-1.0.1-29996.tar.gz size ;-) ... [ ok ]
* checking ebuild checksums ;-) ... [ ok ]
* checking auxfile checksums ;-) ... [ ok ]
* checking miscfile checksums ;-) ... [ ok ]
* checking VMware-server-1.0.1-29996.tar.gz ;-) ... [ ok ]
* Determining the location of the kernel source code
* Found kernel source directory:
* /usr/src/linux
* Found sources for kernel version:
* 2.6.19-gentoo-r4
>>> Unpacking source...
>>> Unpacking VMware-server-1.0.1-29996.tar.gz to /var/tmp/portage/app-emulation/vmware-modules-1.0.0.15/work
>>> Unpacking ./vmware-server-distrib/lib/modules/source/vmmon.tar to /var/tmp/portage/app-emulation/vmware-modules-1.0.0.15/work
* Applying various patches (bugfixes/updates) ...
* 000_all_makefile-include-directory.patch ... [ ok ]
* Done with patching
* Converting vmmon-only/Makefile to use M= instead of SUBDIRS= ... [ ok ]
>>> Unpacking ./vmware-server-distrib/lib/modules/source/vmnet.tar to /var/tmp/portage/app-emulation/vmware-modules-1.0.0.15/work
* Applying various patches (bugfixes/updates) ...
* 000_all_makefile-include-directory.patch ... [ ok ]
* Done with patching
* Converting vmnet-only/Makefile to use M= instead of SUBDIRS= ... [ ok ]
* Applying 1.0.0.15-gcc4-ignore-pedantic-errors.patch ... [ ok ]
* Applying 1.0.0.15-gcc4-ignore-pedantic-errors.patch ... [ ok ]
>>> Source unpacked.
>>> Compiling source in /var/tmp/portage/app-emulation/vmware-modules-1.0.0.15/work ...
* Preparing vmmon module
Using 2.6.x kernel build system.
make[1]: AVERTISSEMENT: serveur de tâches n'est pas disponible: utilisation de -j1. Ajouter « + » à la règle parent du make.

WARNING: Symbol version dump /usr/src/linux-2.6.19-gentoo-r4/Module.symvers
is missing; modules will have no dependencies and modversions.

Building modules, stage 2.
* Preparing vmnet module
Using 2.6.x kernel build system.
make[1]: AVERTISSEMENT: serveur de tâches n'est pas disponible: utilisation de -j1. Ajouter « + » à la règle parent du make.

WARNING: Symbol version dump /usr/src/linux-2.6.19-gentoo-r4/Module.symvers
is missing; modules will have no dependencies and modversions.

/var/tmp/portage/app-emulation/vmware-modules-1.0.0.15/work/vmnet-only/userif.c: In function ‘VNetCopyDatagramToUser’:
/var/tmp/portage/app-emulation/vmware-modules-1.0.0.15/work/vmnet-only/userif.c:629: erreur: ‘CHECKSUM_HW’ undeclared (first use in this function)
/var/tmp/portage/app-emulation/vmware-modules-1.0.0.15/work/vmnet-only/userif.c:629: erreur: (Each undeclared identifier is reported only once
/var/tmp/portage/app-emulation/vmware-modules-1.0.0.15/work/vmnet-only/userif.c:629: erreur: for each function it appears in.)
make[3]: *** [/var/tmp/portage/app-emulation/vmware-modules-1.0.0.15/work/vmnet-only/userif.o] Erreur 1
make[2]: *** [_module_/var/tmp/portage/app-emulation/vmware-modules-1.0.0.15/work/vmnet-only] Erreur 2
make[1]: *** [modules] Erreur 2
make: *** [vmnet.ko] Erreur 2

!!! ERROR: app-emulation/vmware-modules-1.0.0.15 failed.
Call stack:
ebuild.sh, line 1564: Called dyn_compile
ebuild.sh, line 937: Called src_compile
ebuild.sh, line 1257: Called linux-mod_src_compile
linux-mod.eclass, line 482: Called die

!!! Unable to make auto-build VMWARE_VER=VME_S1B1 KERNEL_DIR=/usr/src/linux KBUILD_OUTPUT=/usr/src/linux.
!!! If you need support, post the topmost build error, and the call stack if relevant.

new-host linux #
support4sale
Simple Hen
 
Posts: 43
Joined: Fri Oct 27, 2006 1:40

Je crois que j'ai cassé quelques choses...

Postby support4sale » Sat Jan 27, 2007 7:03

Après avoir essayé tout plein de trucs, dont certains que ne comprenais pas (la plupart) je crois que j'ai fai une connerie car je ne peux plus emerger...


bash: vmware-server: command not found
new-host ~ # emerge vmware-server
Calculating dependencies... done!

>>> Emerging (1 of 1) app-emulation/vmware-server-1.0.1.29996-r4 to /
* vmware-libssl.so.0.9.7l.tar.bz2 MD5 ;-) ... [ ok ]
* vmware-libssl.so.0.9.7l.tar.bz2 RMD160 ;-) ... [ ok ]
* vmware-libssl.so.0.9.7l.tar.bz2 SHA1 ;-) ... [ ok ]
* vmware-libssl.so.0.9.7l.tar.bz2 SHA256 ;-) ... [ ok ]
* vmware-libssl.so.0.9.7l.tar.bz2 size ;-) ... [ ok ]
* vmware-libcrypto.so.0.9.7l.tar.bz2 MD5 ;-) ... [ ok ]
* vmware-libcrypto.so.0.9.7l.tar.bz2 RMD160 ;-) ... [ ok ]
* vmware-libcrypto.so.0.9.7l.tar.bz2 SHA1 ;-) ... [ ok ]
* vmware-libcrypto.so.0.9.7l.tar.bz2 SHA256 ;-) ... [ ok ]
* vmware-libcrypto.so.0.9.7l.tar.bz2 size ;-) ... [ ok ]
* VMware-server-1.0.1-29996.tar.gz MD5 ;-) ... [ ok ]
* VMware-server-1.0.1-29996.tar.gz RMD160 ;-) ... [ ok ]
* VMware-server-1.0.1-29996.tar.gz SHA1 ;-) ... [ ok ]
* VMware-server-1.0.1-29996.tar.gz SHA256 ;-) ... [ ok ]
* VMware-server-1.0.1-29996.tar.gz size ;-) ... [ ok ]
* vmware-server-perl-fixed-rpath-libs.tar.bz2 MD5 ;-) ... [ ok ]
* vmware-server-perl-fixed-rpath-libs.tar.bz2 RMD160 ;-) ... [ ok ]
* vmware-server-perl-fixed-rpath-libs.tar.bz2 SHA1 ;-) ... [ ok ]
* vmware-server-perl-fixed-rpath-libs.tar.bz2 SHA256 ;-) ... [ ok ]
* vmware-server-perl-fixed-rpath-libs.tar.bz2 size ;-) ... [ ok ]
>>> Downloading 'http://distfiles.gentoo.org/distfiles/vmware-any-any-update104.tar.gz'
--01:05:42-- http://distfiles.gentoo.org/distfiles/v ... 104.tar.gz
=> `/usr/portage/distfiles/vmware-any-any-update104.tar.gz'
Résolution de distfiles.gentoo.org... 216.165.129.135, 156.56.247.195, 64.50.236.52, ...
Connexion vers distfiles.gentoo.org|216.165.129.135|:80...connecté.
requête HTTP transmise, en attente de la réponse...404 Not Found
01:05:42 ERREUR 404: Not Found.

>>> Downloading 'http://distro.ibiblio.org/pub/linux/distributions/gentoo/distfiles/vmware-any-any-update104.tar.gz'
--01:05:42-- http://distro.ibiblio.org/pub/linux/dis ... 104.tar.gz
=> `/usr/portage/distfiles/vmware-any-any-update104.tar.gz'
Résolution de distro.ibiblio.org... 152.46.7.109
Connexion vers distro.ibiblio.org|152.46.7.109|:80...connecté.
requête HTTP transmise, en attente de la réponse...404 Not Found
01:05:43 ERREUR 404: Not Found.

>>> Downloading 'http://ftp.cvut.cz/vmware/vmware-any-any-update104.tar.gz'
--01:05:43-- http://ftp.cvut.cz/vmware/vmware-any-an ... 104.tar.gz
=> `/usr/portage/distfiles/vmware-any-any-update104.tar.gz'
Résolution de ftp.cvut.cz... 147.32.160.17
Connexion vers ftp.cvut.cz|147.32.160.17|:80...connecté.
requête HTTP transmise, en attente de la réponse...404 Not Found
01:05:44 ERREUR 404: Not Found.

>>> Downloading 'http://ftp.cvut.cz/vmware/obselete/vmware-any-any-update104.tar.gz'
--01:05:44-- http://ftp.cvut.cz/vmware/obselete/vmwa ... 104.tar.gz
=> `/usr/portage/distfiles/vmware-any-any-update104.tar.gz'
Résolution de ftp.cvut.cz... 147.32.160.17
Connexion vers ftp.cvut.cz|147.32.160.17|:80...connecté.
requête HTTP transmise, en attente de la réponse...404 Not Found
01:05:44 ERREUR 404: Not Found.

>>> Downloading 'http://knihovny.cvut.cz/ftp/pub/vmware/vmware-any-any-update104.tar.gz'
--01:05:44-- http://knihovny.cvut.cz/ftp/pub/vmware/ ... 104.tar.gz
=> `/usr/portage/distfiles/vmware-any-any-update104.tar.gz'
Résolution de knihovny.cvut.cz... 147.32.240.81
Connexion vers knihovny.cvut.cz|147.32.240.81|:80...connecté.
requête HTTP transmise, en attente de la réponse...404 Not Found
01:05:44 ERREUR 404: Not Found.

>>> Downloading 'http://knihovny.cvut.cz/ftp/pub/vmware/obselete/vmware-any-any-update104.tar.gz'
--01:05:44-- http://knihovny.cvut.cz/ftp/pub/vmware/ ... 104.tar.gz
=> `/usr/portage/distfiles/vmware-any-any-update104.tar.gz'
Résolution de knihovny.cvut.cz... 147.32.240.81
Connexion vers knihovny.cvut.cz|147.32.240.81|:80...connecté.
requête HTTP transmise, en attente de la réponse...404 Not Found
01:05:45 ERREUR 404: Not Found.

!!! Couldn't download 'vmware-any-any-update104.tar.gz'. Aborting.
new-host ~ #
support4sale
Simple Hen
 
Posts: 43
Joined: Fri Oct 27, 2006 1:40

je crois que j'ai peut-etre trouvé le problème...

Postby support4sale » Mon Jan 29, 2007 16:04

kuroo me dit :No versions available on amd64 ~amd64


Autrement dit est ce qu'il n'y a aucune chance de faire fonctionner vmware-server sur cette distro en 64 bits ?
support4sale
Simple Hen
 
Posts: 43
Joined: Fri Oct 27, 2006 1:40

j'arrive à démarrer la console de vmware mais...

Postby support4sale » Tue Jan 30, 2007 16:10

vmware
/opt/vmware/server/lib/bin/vmware: /opt/vmware/server/lib/lib/libpng12.so.0/libpng12.so.0: no version information available (required by /emul/linux/x86/usr/lib/libcairo.so.2)
Fontconfig warning: line 32: unknown element "cachedir"
Fontconfig warning: line 33: unknown element "cachedir"
Fontconfig warning: "/etc/fonts/conf.d/80-delicious.conf", line 18: invalid match target "scan"

et en plus je ne peux pas démarrer la moindre machine virtuelle.

Unable to change virtual machine power state: The process exited with an error:
End of error message.

Je crois que le service vmmon (moniteur de machines virtuelles) n'est pas démarré par défaut et je ne sais ni comment vérifier, ni comment le forcer à démarrer.

le fichier not_configured dans /etc/vmware/ persiste à revenir.
support4sale
Simple Hen
 
Posts: 43
Joined: Fri Oct 27, 2006 1:40


Return to French

Who is online

Users browsing this forum: No registered users and 0 guests

cron