emerge wine 9.0.30 en amd64

Conversaciones generales alrededor Sabayon Linux

Moderator: Moderators

Post Reply
loracs
Baby Hen
Posts: 1
Joined: Wed Jan 31, 2007 15:57

emerge wine 9.0.30 en amd64

Post by loracs » Wed Jan 31, 2007 16:07

Buenas,

pues despues de estar un añito con kubuntu, me he decidido a dar el paso, asi que a pesar de estar leyendo intesivamente foros y how to, me encuentro perdido con los errores que me devuelve el emerge de wine. Tengo la version 0.9.28 que es la version que trae sabayon 3.26.

Me dice esto, cuando empieza con el make, hasta entonces no veo errores:


Configure finished. Do 'make depend && make' to compile Wine.

parser.y: conflictos: 12 desplazamiento(s)/reducción(ones)
parser.y: conflictos: 12 desplazamiento(s)/reducción(ones)
lang.o: In function `show_codepages':
lang.c:(.text+0xd5): referencia a `wine_cp_enum_table' sin definir
lang.o: In function `find_codepage':
lang.c:(.text+0x15): referencia a `wine_cp_get_table' sin definir
mcl.o: In function `get_unichar':
mcl.c:(.text+0x372): referencia a `wine_cp_mbstowcs' sin definir
write.o: In function `dup_u2c':
write.c:(.text+0x18c): referencia a `wine_cp_wcstombs' sin definir
write.c:(.text+0x1d5): referencia a `wine_cp_wcstombs' sin definir
write.o: In function `write_rc_file':
write.c:(.text+0x7b3): referencia a `wine_cp_wcstombs' sin definir
write.c:(.text+0x802): referencia a `wine_cp_wcstombs' sin definir
collect2: ld devolvió el estado de salida 1
make[2]: *** [wmc] Error 1
make[1]: *** [wmc] Error 2
make[1]: *** Se espera a que terminen otras tareas....
parser.y: conflictos: 5 desplazamiento(s)/reducción(ones)
parser.y: conflictos: 5 desplazamiento(s)/reducción(ones)
genres.o: In function `put_name_id':
genres.c:(.text+0xbc4): referencia a `wine_casemap_upper' sin definir
genres.c:(.text+0xbce): referencia a `wine_casemap_upper' sin definir
utils.o: In function `get_language_codepage':
utils.c:(.text+0x50): referencia a `wine_cp_get_table' sin definir
utils.o: In function `convert_string':
utils.c:(.text+0x66e): referencia a `wine_cp_get_table' sin definir
utils.c:(.text+0x6d6): referencia a `wine_cp_mbstowcs' sin definir
utils.c:(.text+0x711): referencia a `wine_cp_mbstowcs' sin definir
utils.c:(.text+0x7be): referencia a `wine_cp_wcstombs' sin definir
utils.c:(.text+0x806): referencia a `wine_cp_wcstombs' sin definir
utils.c:(.text+0x8bc): referencia a `wine_utf8_mbstowcs' sin definir
utils.c:(.text+0x8f0): referencia a `wine_utf8_mbstowcs' sin definir
utils.c:(.text+0x941): referencia a `wine_utf8_wcstombs' sin definir
utils.c:(.text+0x96a): referencia a `wine_utf8_wcstombs' sin definir
utils.o: In function `compare_name_id':
utils.c:(.text+0x5e4): referencia a `strcmpiW' sin definir
parser.yy.o: In function `parser_lex':
parser.yy.c:(.text+0x19cf): referencia a `wine_cp_get_table' sin definir
collect2: ld devolvió el estado de salida 1
make[2]: *** [wrc] Error 1
make[1]: *** [wrc] Error 2
make: *** [tools] Error 2

utils.o: In function `convert_string':
utils.c:(.text+0x66e): referencia a `wine_cp_get_table' sin definir
utils.c:(.text+0x6d6): referencia a `wine_cp_mbstowcs' sin definir
utils.c:(.text+0x711): referencia a `wine_cp_mbstowcs' sin definir
utils.c:(.text+0x7be): referencia a `wine_cp_wcstombs' sin definir
utils.c:(.text+0x806): referencia a `wine_cp_wcstombs' sin definir
utils.c:(.text+0x8bc): referencia a `wine_utf8_mbstowcs' sin definir
utils.c:(.text+0x8f0): referencia a `wine_utf8_mbstowcs' sin definir
utils.c:(.text+0x941): referencia a `wine_utf8_wcstombs' sin definir
utils.c:(.text+0x96a): referencia a `wine_utf8_wcstombs' sin definir
utils.o: In function `compare_name_id':
utils.c:(.text+0x5e4): referencia a `strcmpiW' sin definir
parser.yy.o: In function `parser_lex':
parser.yy.c:(.text+0x19cf): referencia a `wine_cp_get_table' sin definir
collect2: ld devolvió el estado de salida 1
make[2]: *** [wrc] Error 1
make[1]: *** [wrc] Error 2
make: *** [tools] Error 2

!!! ERROR: app-emulation/wine-0.9.30 failed.
Call stack:
ebuild.sh, line 1611: Called dyn_compile
ebuild.sh, line 968: Called qa_call 'src_compile'
environment, line 3325: Called src_compile
wine-0.9.30.ebuild, line 107: Called die

No se que datos puedo aportar o que puedo hacer para orientar/orientarme hacia donde debe ir el error, he cambiado las use del make.conf que trae por defecto, pero ni usando las use que trae el make.conf de "serie", me da el mismo error.

Agradezco vuestra ayuda desde ya!

Un saludo y gracias de nuevo. Impresionante esta esta version :D

Post Reply