Problem With Clementine and Google drive

Discussions Regarding Software

Moderator: Moderators

Problem With Clementine and Google drive

Postby sabre » Thu Jul 18, 2013 23:11

I've Installed Clementine 1.1.1 but it not appeared the option to search en google drive. Someone know how to add it ??
sabre
Baby Hen
 
Posts: 12
Joined: Tue Mar 26, 2013 23:44

Re: Problem With Clementine and Google drive

Postby mc_crafty » Sat Jul 20, 2013 2:07

I had this problem a while ago. Seems that the compile flags in Sabayon for it are not enabled. My first thought was to use the gentoo ebuild for it, but that had a lot of dependency issues.

The best way to use Clementine for Sabayon is to compile yourself. Lucky for us, clementine uses cmake and the process is really easy.

The official guide is here: https://code.google.com/p/clementine-pl ... FromSource

tl;dr
Look through Sabayon repos for sparsehash ( needed for GoogleDrive Support ) and git ( needed to get clementine code ). Then run these from a terminal:
cd "Where ever you want to install Clementine"
git clone https://code.google.com/p/clementine-player/ clementine-player
cd clementine-player
mkdir bin
cd bin
cmake ../
make
sudo make install

Hope this helps.
mc_crafty
Baby Hen
 
Posts: 5
Joined: Tue Jul 16, 2013 6:35

Re: Problem With Clementine and Google drive

Postby tollgate » Sun Jul 21, 2013 6:55

Try as root:

emerge --sync
USE="googledrive" emerge clementine
equo rescue spmsync
tollgate
Growing Hen
 
Posts: 105
Joined: Thu May 31, 2012 3:57
Location: Jomtien, Thailand

Re: Problem With Clementine and Google drive

Postby sabre » Sun Jul 21, 2013 22:38

I Never compile

I tried it but I have the following message

Code: Select all
-- The C compiler identification is unknown
-- The CXX compiler identification is unknown
-- Check for working C compiler: /usr/bin/cc
-- Check for working C compiler: /usr/bin/cc -- broken
CMake Error at /usr/share/cmake/Modules/CMakeTestCCompiler.cmake:61 (message):
  The C compiler "/usr/bin/cc" is not able to compile a simple test program.

  It fails with the following output:

   Change Dir: /home/sabre/Clementine/clementine-player/bin/CMakeFiles/CMakeTmp

 

  Run Build Command:/usr/bin/gmake "cmTryCompileExec3133852979/fast"

  /usr/bin/gmake -f CMakeFiles/cmTryCompileExec3133852979.dir/build.make
  CMakeFiles/cmTryCompileExec3133852979.dir/build

  gmake[1]: se ingresa al directorio
  `/home/sabre/Clementine/clementine-player/bin/CMakeFiles/CMakeTmp'

  /usr/bin/cmake -E cmake_progress_report
  /home/sabre/Clementine/clementine-player/bin/CMakeFiles/CMakeTmp/CMakeFiles
  1

  Building C object
  CMakeFiles/cmTryCompileExec3133852979.dir/testCCompiler.c.o

  /usr/bin/cc -o CMakeFiles/cmTryCompileExec3133852979.dir/testCCompiler.c.o
  -c
  /home/sabre/Clementine/clementine-player/bin/CMakeFiles/CMakeTmp/testCCompiler.c


  gcc-config: error: could not run/locate 'gcc'

  gmake[1]: *** [CMakeFiles/cmTryCompileExec3133852979.dir/testCCompiler.c.o]
  Error 1

  gmake[1]: se sale del directorio
  `/home/sabre/Clementine/clementine-player/bin/CMakeFiles/CMakeTmp'

  gmake: *** [cmTryCompileExec3133852979/fast] Error 2

 

 

  CMake will not be able to correctly generate this project.
Call Stack (most recent call first):
 


-- Configuring incomplete, errors occurred!


Any ideas
sabre
Baby Hen
 
Posts: 12
Joined: Tue Mar 26, 2013 23:44


Return to Software in General

Who is online

Users browsing this forum: No registered users and 2 guests

cron