Unable to emerge gcc 4.6.3

Discussion in general that pertains to Sabayon Linux - Must Pertain to Sabayon Linux

Moderator: Moderators

Post Reply
sabayanus
Baby Hen
Posts: 15
Joined: Wed Mar 20, 2013 1:57

Unable to emerge gcc 4.6.3

Post by sabayanus » Wed Apr 10, 2013 19:29

I do an revdep-rebuild to fix broken packages, I did that very many times, and always it's try to compile gcc.
And I get a error
Here's log:

Code: Select all

/var/tmp/portage/sys-devel/gcc-4.6.3/work/gcc-4.6.3/libjava/classpath/javax/swing/plaf/basic/BasicLookAndFeel.java:483:0: note: variable tracking size limit exceeded with -fvar-tracking-assignments, retrying without
libtool: compile:  /var/tmp/portage/sys-devel/gcc-4.6.3/work/build/./gcc/gcj -B/var/tmp/portage/sys-devel/gcc-4.6.3/work/build/x86_64-pc-linux-gnu/32/libjava/ -B/var/tmp/portage/sys-devel/gcc-4.6.3/work/build/x86_64-pc-linux-gnu/32/libjava/ -B/var/tmp/portage/sys-devel/gcc-4.6.3/work/build/./gcc/ -B/usr/x86_64-pc-linux-gnu/bin/ -B/usr/x86_64-pc-linux-gnu/lib/ -isystem /usr/x86_64-pc-linux-gnu/include -isystem /usr/x86_64-pc-linux-gnu/sys-include -m32 -ffloat-store -fomit-frame-pointer -fclasspath= -fbootclasspath=/var/tmp/portage/sys-devel/gcc-4.6.3/work/gcc-4.6.3/libjava/classpath/lib --encoding=UTF-8 -Wno-deprecated -fbootstrap-classes -march=x86-64 -pipe -ggdb -fstack-protector-all -O2 -m32 -c -fsource-filename=/var/tmp/portage/sys-devel/gcc-4.6.3/work/build/x86_64-pc-linux-gnu/32/libjava/classpath/lib/classes -MT javax/swing/plaf/basic.lo -MD -MP -MF javax/swing/plaf/basic.deps @javax/swing/plaf/basic.list -o javax/swing/plaf/basic.o >/dev/null 2>&1
make[5]: *** [gnu/java/nio/charset.lo] Error 1
make[5]: *** Waiting for unfinished jobs....
libtool: compile:  /var/tmp/portage/sys-devel/gcc-4.6.3/work/build/./gcc/gcj -B/var/tmp/portage/sys-devel/gcc-4.6.3/work/build/x86_64-pc-linux-gnu/32/libjava/ -B/var/tmp/portage/sys-devel/gcc-4.6.3/work/build/x86_64-pc-linux-gnu/32/libjava/ -B/var/tmp/portage/sys-devel/gcc-4.6.3/work/build/./gcc/ -B/usr/x86_64-pc-linux-gnu/bin/ -B/usr/x86_64-pc-linux-gnu/lib/ -isystem /usr/x86_64-pc-linux-gnu/include -isystem /usr/x86_64-pc-linux-gnu/sys-include -m32 -ffloat-store -fomit-frame-pointer -fclasspath= -fbootclasspath=/var/tmp/portage/sys-devel/gcc-4.6.3/work/gcc-4.6.3/libjava/classpath/lib --encoding=UTF-8 -Wno-deprecated -fbootstrap-classes -march=x86-64 -pipe -ggdb -fstack-protector-all -O2 -m32 -c -fsource-filename=/var/tmp/portage/sys-devel/gcc-4.6.3/work/build/x86_64-pc-linux-gnu/32/libjava/classpath/lib/classes -MT javax/swing.lo -MD -MP -MF javax/swing.deps @javax/swing.list -o javax/swing.o >/dev/null 2>&1
libtool: compile:  /var/tmp/portage/sys-devel/gcc-4.6.3/work/build/./gcc/gcj -B/var/tmp/portage/sys-devel/gcc-4.6.3/work/build/x86_64-pc-linux-gnu/32/libjava/ -B/var/tmp/portage/sys-devel/gcc-4.6.3/work/build/x86_64-pc-linux-gnu/32/libjava/ -B/var/tmp/portage/sys-devel/gcc-4.6.3/work/build/./gcc/ -B/usr/x86_64-pc-linux-gnu/bin/ -B/usr/x86_64-pc-linux-gnu/lib/ -isystem /usr/x86_64-pc-linux-gnu/include -isystem /usr/x86_64-pc-linux-gnu/sys-include -m32 -ffloat-store -fomit-frame-pointer -fclasspath= -fbootclasspath=/var/tmp/portage/sys-devel/gcc-4.6.3/work/gcc-4.6.3/libjava/classpath/lib --encoding=UTF-8 -Wno-deprecated -fbootstrap-classes -findirect-dispatch -fno-bootstrap-classes -fno-indirect-classes -fsource-filename=/var/tmp/portage/sys-devel/gcc-4.6.3/work/build/x86_64-pc-linux-gnu/32/libjava/classpath/tools/all-classes.lst -march=x86-64 -pipe -ggdb -fstack-protector-all -O2 -m32 -MT classpath/tools/libgcj_tools_la-tools.lo -MD -MP -MF classpath/tools/.deps/libgcj_tools_la-tools.Tpo -c classpath/tools/tools.zip -o classpath/tools/libgcj_tools_la-tools.o >/dev/null 2>&1
make[4]: *** [all-recursive] Error 1
make[3]: *** [multi-do] Error 1
make[2]: *** [all-multi] Error 2
make[1]: *** [all-target-libjava] Error 2
make: *** [bootstrap-lean] Error 2
emake failed
 [31;01m*[0m ERROR: sys-devel/gcc-4.6.3 failed (compile phase):
 [31;01m*[0m   emake failed with bootstrap-lean
 [31;01m*[0m 
 [31;01m*[0m Call stack:
 [31;01m*[0m     ebuild.sh, line   93:  Called src_compile
 [31;01m*[0m   environment, line 4140:  Called toolchain_src_compile
 [31;01m*[0m   environment, line 4800:  Called gcc_do_make
 [31;01m*[0m   environment, line 2439:  Called die
 [31;01m*[0m The specific snippet of code:
 [31;01m*[0m       emake LDFLAGS="${LDFLAGS}" STAGE1_CFLAGS="${STAGE1_CFLAGS}" LIBPATH="${LIBPATH}" BOOT_CFLAGS="${BOOT_CFLAGS}" ${GCC_MAKE_TARGET} || die "emake failed with ${GCC_MAKE_TARGET}";
 [31;01m*[0m 
 [31;01m*[0m If you need support, post the output of `emerge --info '=sys-devel/gcc-4.6.3'`,
 [31;01m*[0m the complete build log and the output of `emerge -pqv '=sys-devel/gcc-4.6.3'`.
 [31;01m*[0m 
 [31;01m*[0m Please include /var/tmp/portage/sys-devel/gcc-4.6.3/work/build/gcc-build-logs.tar.bz2 in your bug report
 [31;01m*[0m 
 [31;01m*[0m The complete build log is located at '/var/tmp/portage/sys-devel/gcc-4.6.3/temp/build.log'.
 [31;01m*[0m The ebuild environment file is located at '/var/tmp/portage/sys-devel/gcc-4.6.3/temp/environment'.
 [31;01m*[0m Working directory: '/var/tmp/portage/sys-devel/gcc-4.6.3/work/build'
 [31;01m*[0m S: '/var/tmp/portage/sys-devel/gcc-4.6.3/work/build'

User avatar
sabayonino
Sagely Hen
Posts: 3190
Joined: Sun Sep 21, 2008 1:12
Location: Italy
Contact:

Re: Unable to emerge gcc 4.6.3

Post by sabayonino » Wed Apr 10, 2013 22:08

I had the same prob. in my gentoo and all gcc versions

dev-util/kbuild-0.1.9998_pre20120806

Code: Select all

# equo i kbuild
or

Code: Select all

# emerge kbuild
solved my probl
[Che Cos'è Il Calcolo Distribuito (BOINC)

BOINC ready ! Sabayon+BOINC = BILD ,my Sabayon spin :cyclops: - Ready to crunch for the Science everywhere :)

sabayanus
Baby Hen
Posts: 15
Joined: Wed Mar 20, 2013 1:57

Re: Unable to emerge gcc 4.6.3

Post by sabayanus » Wed Apr 10, 2013 23:02

Thanks very much to awnser me.
I tried emerge it, but get errors:

Code: Select all

configure: error: in `/var/tmp/portage/dev-util/kbuild-0.1.9998_pre20120806/work/kBuild-0.1.9998-pre20120806/out/linux.amd64/release/bootstrap/kmk':
configure: error: C compiler cannot create executables
See `config.log' for more details
make: *** [/var/tmp/portage/dev-util/kbuild-0.1.9998_pre20120806/work/kBuild-0.1.9998-pre20120806/out/linux.amd64/release/bootstrap/kmk/ts-configured] Error 77
kBuild/env.sh: info: rc=2: make -f bootstrap.gmk AUTORECONF=true AR=x86_64-pc-linux-gnu-ar
 [31;01m*[0m ERROR: dev-util/kbuild-0.1.9998_pre20120806 failed (compile phase):
 [31;01m*[0m   bootstrap failed
 [31;01m*[0m 
 [31;01m*[0m Call stack:
 [31;01m*[0m     ebuild.sh, line  93:  Called src_compile
 [31;01m*[0m   environment, line 2880:  Called die
 [31;01m*[0m The specific snippet of code:
 [31;01m*[0m       kBuild/env.sh --full make -f bootstrap.gmk AUTORECONF=true AR="$(tc-getAR)" || die "bootstrap failed"
 [31;01m*[0m 
 [31;01m*[0m If you need support, post the output of `emerge --info '=dev-util/kbuild-0.1.9998_pre20120806'`,
 [31;01m*[0m the complete build log and the output of `emerge -pqv '=dev-util/kbuild-0.1.9998_pre20120806'`.
 [31;01m*[0m The complete build log is located at '/var/tmp/portage/dev-util/kbuild-0.1.9998_pre20120806/temp/build.log'.
 [31;01m*[0m The ebuild environment file is located at '/var/tmp/portage/dev-util/kbuild-0.1.9998_pre20120806/temp/environment'.
 [31;01m*[0m Working directory: '/var/tmp/portage/dev-util/kbuild-0.1.9998_pre20120806/work/kBuild-0.1.9998-pre20120806'
 [31;01m*[0m S: '/var/tmp/portage/dev-util/kbuild-0.1.9998_pre20120806/work/kBuild-0.1.9998-pre20120806'
After that I installed with equo, note that gcc is working, I have installed here, 4.6.3, 4.5 and 4.7

sabayanus
Baby Hen
Posts: 15
Joined: Wed Mar 20, 2013 1:57

Re: Unable to emerge gcc 4.6.3

Post by sabayanus » Wed Apr 10, 2013 23:07

Now I do revdep-rebuild again?

User avatar
sabayonino
Sagely Hen
Posts: 3190
Joined: Sun Sep 21, 2008 1:12
Location: Italy
Contact:

Re: Unable to emerge gcc 4.6.3

Post by sabayonino » Wed Apr 10, 2013 23:31

Code: Select all

configure: error: C compiler cannot create executables
did you install gcc ??

http://forum.sabayon.org/viewtopic.php?f=59&t=29638
[Che Cos'è Il Calcolo Distribuito (BOINC)

BOINC ready ! Sabayon+BOINC = BILD ,my Sabayon spin :cyclops: - Ready to crunch for the Science everywhere :)

sabayanus
Baby Hen
Posts: 15
Joined: Wed Mar 20, 2013 1:57

Re: Unable to emerge gcc 4.6.3

Post by sabayanus » Wed Apr 10, 2013 23:37

Yes.

sabayanus
Baby Hen
Posts: 15
Joined: Wed Mar 20, 2013 1:57

Re: Unable to emerge gcc 4.6.3

Post by sabayanus » Wed Apr 10, 2013 23:38

It is running perfectly.

Ryuno-Ki
Old Dear Hen
Posts: 478
Joined: Mon Feb 27, 2012 22:15
Location: Southern Germany
Contact:

Re: Unable to emerge gcc 4.6.3

Post by Ryuno-Ki » Thu Apr 11, 2013 19:20

German Wiki translator ◆ Want to contribute on the wiki? Ask the Bureaucrats!
Please, mark solved threads ◆ Posts unread and unansweredPackage requests

Post Reply